{"text_format":"1","workbook":"xlsx","n_sheets":12,"sheets":["ControlPanel","Data","RepControl","RepCombined","RepSE","RepSS","RepEE","RepSummary","Macro_MUM","ReadMe","DateTime","Work"],"not_rendered":{"charts":0,"images":4,"macros":1,"external_links":0,"defined_names":155,"comments":0,"pivot_tables":0},"unopened":[],"bounds":{"document_bytes":16777216,"sheet_cells":100000,"rows_first":2000,"rows_last":500,"rows_between":2000,"halvings":0,"cell_chars":16384,"cell_head_chars":4096},"cells_cut":0,"cells_raw":0,"read":"whole","date_system":"1900"}

{"sheet":"ControlPanel","index":0,"n_rows":67,"n_cols":12,"rows_kept":67,"cut":false,"hidden":false,"merged":[[0,7,0,8],[0,10,0,11],[4,0,5,0],[7,0,8,0],[60,0,61,0],[63,0,64,0],[66,0,67,0],[0,0,2,0],[22,0,24,0],[13,0,14,0],[16,0,17,0],[19,0,20,0],[10,0,11,0],[27,0,29,0],[31,0,33,0],[35,0,37,0]]}
[null,null,"Status","Date","Sheet","Contains",null,"Samples",null,null,"Loci"]
[null,null,"Clear","2021-05-09T18:19:06.080","Data","Comma-separated-string allele lists for all samples",null,"Type","#",null,"Locus","#"]
[null,null,"Clear","2021-05-09T18:19:06.080","RepCombined","Combined allele lists",null,"Blank",0]
[null,null,"Clear","2021-05-09T18:19:06.090","RepSE","Detailed breakdown of Standard alleles shared with Evidence",null,"Control",0]
[null,null,"Clear","2021-05-09T18:19:06.110","RepSS","Detailed breakdown of Standard alleles shared with other Standards",null,"Disabled",0]
[null,null,"Clear","2021-05-09T18:19:06.120","RepEE","Detailed breakdown of Evidence alleles shared with other Evidence",null,"Evidence",0]
[null,null,"Clear","2021-05-09T18:19:06.140","RepControl","Detailed breakdown of Control alleles shared with all other samples",null,"Suspect",0]
[null,null,"Clear","2021-05-09T18:19:06.150","RepSummary","Summary of all comparisons",null,"Victim",0]
[null,null,null,null,null,null,null,"Xclude",0]
[null,null,null,null,null,null,null,"Unassigned",0]
{"$rows_left_out":58}
{"sheet":"Data","index":1,"n_rows":0,"n_cols":0,"rows_kept":0,"cut":false,"hidden":false,"merged":[]}

{"sheet":"RepControl","index":2,"n_rows":0,"n_cols":0,"rows_kept":0,"cut":false,"hidden":false,"merged":[]}

{"sheet":"RepCombined","index":3,"n_rows":0,"n_cols":0,"rows_kept":0,"cut":false,"hidden":false,"merged":[]}

{"sheet":"RepSE","index":4,"n_rows":0,"n_cols":0,"rows_kept":0,"cut":false,"hidden":false,"merged":[]}

{"sheet":"RepSS","index":5,"n_rows":0,"n_cols":0,"rows_kept":0,"cut":false,"hidden":false,"merged":[]}

{"sheet":"RepEE","index":6,"n_rows":0,"n_cols":0,"rows_kept":0,"cut":false,"hidden":false,"merged":[]}

{"sheet":"RepSummary","index":7,"n_rows":0,"n_cols":0,"rows_kept":0,"cut":false,"hidden":false,"merged":[]}

{"sheet":"Macro_MUM","index":8,"n_rows":297,"n_cols":35,"rows_kept":297,"cut":false,"hidden":false,"merged":[]}
["MUM_Globals","Parameter","Value","MUM_Exit","MUM_ConRestore","MUM_DoAll","MUM_Cancel","MUM_DataClear","MUM_RepClear","MUM_DisSum","MUM_DataFetch","MUM_DataFetch_Basic","MUM_DataFetch_BodeData","MUM_DataFetch_Standard","MUM_ControlAdd","MUM_DataCheck","MUM_AllelesList","MUM_DataParam","MUM_RepCombined","MUM_AllelesCol","MUM_RepStdEvi","MUM_RepStdStd","MUM_RepEviEvi","MUM_RepControl","MUM_RepSummary","MUM_Print","MUM_Zoom","MUM_ReadMe","MUM_GetStarted",null,"Utility_CleanUpNames","Atmp1","Utility_ResetHeaders","Utility_UnHide","Utility_FormatButtons"]
[{"$f":"SET.NAME(\"Asyst\",\"mixSTR\")","v":true},"R1C1 mode",true,"! Exit - Invoked from Auto_Close","! Return to the control sheet","! Do everything","! User interruption","! Clear the data","! Clear the reports","! Display summary of current data","! Drive the data fetch","! Fetch standard format","! Fetch Bode format","! Fetch standard format","! Fetch the controls","! Check the data","! Check the alleles","! Store data structure","! Make the combined allele lists","! Make allele lists","! Report allele matches for all standards in all Evidence","! Report allele matches for all Standards in other Standards","! Report allele matches for all Standards in other Standards","! Report allele matches for all standards in all controls","! Make summary re;port","! Print any \"Complete\" Reports","! Set the default zoom","! Go to Readme","! Make sure all is ready after coming from ReadMe",null,"! Get rid of all the transcients","Atmp2","! Reset Page Headers of visible files","! Unhide all the hidden stuff","! Format the ControlPanel"]
[{"$f":"SET.NAME(\"Adate\",\"7-May-2021\")","v":true},"Calculation mode",3,{"$f":"MESSAGE(TRUE,TEXT(NOW(),AlngDatTim)&\"  \"&D$1)","v":true},{"$f":"MESSAGE(TRUE,TEXT(NOW(),AlngDatTim)&\"  \"&E$1)","v":true},{"$f":"OPTIONS.CALCULATION(3)","v":true},{"$f":"DLD_ScreenUpdateOn()","v":false},{"$f":"MESSAGE(TRUE,TEXT(NOW(),AlngDatTim)&\"  \"&H$1)","v":true},{"$f":"MESSAGE(TRUE,TEXT(NOW(),AlngDatTim)&\"  \"&I$1)","v":true},{"$f":"MESSAGE(TRUE,TEXT(NOW(),AlngDatTim)&\"  \"&J$1)","v":true},{"$f":"MESSAGE(TRUE,TEXT(NOW(),AlngDatTim)&\"  \"&K$1)","v":true},{"$f":"MESSAGE(TRUE,TEXT(NOW(),AlngDatTim)&\"  \"&L$1)","v":true},{"$f":"MESSAGE(TRUE,TEXT(NOW(),AlngDatTim)&\"  \"&M$1)","v":false},{"$f":"MESSAGE(TRUE,TEXT(NOW(),AlngDatTim)&\"  \"&N$1)","v":true},{"$f":"MESSAGE(TRUE,TEXT(NOW(),AlngDatTim)&\"  \"&O$1)","v":true},{"$f":"MESSAGE(TRUE,TEXT(NOW(),AlngDatTim)&\"  \"&P$1)","v":true},{"$f":"DLD_ScreenUpdateOff()","v":0},{"$f":"MESSAGE(TRUE,TEXT(NOW(),AlngDatTim)&\"  \"&R$1)","v":true},{"$f":"MESSAGE(TRUE,TEXT(NOW(),AlngDatTim)&\"  \"&S$1)","v":true},{"$f":"DLD_ScreenUpdateOff()","v":0},{"$f":"MESSAGE(TRUE,TEXT(NOW(),AlngDatTim)&\"  \"&U$1)","v":true},{"$f":"MESSAGE(TRUE,TEXT(NOW(),AlngDatTim)&\"  \"&V$1)","v":true},{"$f":"MESSAGE(TRUE,TEXT(NOW(),AlngDatTim)&\"  \"&W$1)","v":true},{"$f":"MESSAGE(TRUE,TEXT(NOW(),AlngDatTim)&\"  \"&X$1)","v":true},{"$f":"MESSAGE(TRUE,TEXT(NOW(),AlngDatTim)&\"  \"&Y$1)","v":true},{"$f":"MESSAGE(TRUE,TEXT(NOW(),AlngDatTim)&\" \"&Z$1)","v":true},{"$f":"MESSAGE(TRUE,TEXT(NOW(),AlngDatTim)&\" \"&AA$1)","v":true},{"$f":"MESSAGE(TRUE,TEXT(NOW(),AlngDatTim)&\"  \"&AB$1)","v":true},{"$f":"MESSAGE(TRUE,TEXT(NOW(),AlngDatTim)&\"  \"&AC$1)","v":true},null,null,"Atmp3",{"$f":"DLD_ScreenUpdateOff()","v":0},{"$f":"DLD_ScreenUpdateOff()","v":0},{"$f":"DLD_ScreenUpdateOff()","v":0}]
[{"$f":"MESSAGE(FALSE)","v":true},"Start datetime","2021-05-09T18:19:13.940",{"$f":"DLD_ScreenUpdateOff()","v":0},{"$f":"DLD_ScreenUpdateOff()","v":0},{"$f":"CANCEL.KEY(TRUE,MUM_Cancel)","v":true},null,{"$f":"DLD_ScreenUpdateOff()","v":0},{"$f":"DLD_ScreenUpdateOff()","v":0},{"$f":"DLD_ScreenUpdateOff()","v":0},{"$f":"DLD_ScreenUpdateOff()","v":0},{"$f":"DLD_ScreenUpdateOff()","v":0},{"$f":"DLD_ScreenUpdateOff()","v":false},{"$f":"DLD_ScreenUpdateOff()","v":0},{"$f":"DLD_ScreenUpdateOff()","v":0},{"$f":"DLD_ScreenUpdateOff()","v":0},null,{"$f":"DLD_ScreenUpdateOff()","v":0},{"$f":"DLD_ScreenUpdateOff()","v":0},null,{"$f":"DLD_ScreenUpdateOff()","v":0},{"$f":"DLD_ScreenUpdateOff()","v":0},{"$f":"DLD_ScreenUpdateOff()","v":0},{"$f":"DLD_ScreenUpdateOff()","v":0},{"$f":"DLD_ScreenUpdateOff()","v":0},{"$f":"DLD_ScreenUpdateOff()","v":0},{"$f":"DLD_ScreenUpdateOff()","v":0},{"$f":"DLD_ScreenUpdateOff()","v":0},{"$f":"DLD_ScreenUpdateOff()","v":0},null,{"$f":"SET.NAME(\"Atmp1\",COUNTA(NAMES()))","v":true},"Atmp4"]
[{"$f":"DLD_ScreenUpdateOff()","v":0},"Stop datetime",44325.763502199072,null,null,null,{"$f":"RUN(MUM_ConRestore,FALSE)","v":{"$error":"#N/A"}},{"$f":"CANCEL.KEY(TRUE,MUM_Cancel)","v":true},{"$f":"CANCEL.KEY(TRUE,MUM_Cancel)","v":true},null,{"$f":"CANCEL.KEY(TRUE,MUM_Cancel)","v":true},{"$f":"CANCEL.KEY(TRUE,MUM_Cancel)","v":true},{"$f":"CANCEL.KEY(TRUE,MUM_Cancel)","v":true},{"$f":"CANCEL.KEY(TRUE,MUM_Cancel)","v":true},{"$f":"CANCEL.KEY(TRUE,MUM_Cancel)","v":true},{"$f":"CANCEL.KEY(TRUE,MUM_Cancel)","v":true},{"$f":"ACTIVATE(S0wrk)","v":true},null,{"$f":"SET.NAME(\"RepR\",3)","v":true},{"$f":"ACTIVATE(S0wrk)","v":true},{"$f":"SET.NAME(\"RepR\",4)","v":true},{"$f":"SET.NAME(\"RepR\",5)","v":true},{"$f":"SET.NAME(\"RepR\",6)","v":true},{"$f":"SET.NAME(\"RepR\",7)","v":true},{"$f":"SET.NAME(\"RepR\",8)","v":true},null,null,null,null,null,{"$f":"FOR(\"Atmp2\",Atmp1,1,-1)","v":true},"MUM_AllelesCol","! Reset ControlPanel",{"$f":"ERROR(FALSE)","v":true},"! Format the ReadMe"]
[null,"User","Duewer, David L. Dr. (Fed)","! Restore calculation and RC states",{"$f":"ACTIVATE(S0con)","v":true},"! Setup the ControlPanel",{"$f":"dld_msgbar(WB_0&\" has been interrupted!\",TRUE)","v":false},null,null,"! Setup",null,null,null,null,null,null,{"$f":"dld_clearcols(3,7,FALSE)","v":0},"! Store structure on the Work sheet",null,{"$f":"dld_clearcols(2,10,FALSE)","v":0},null,null,null,null,null,"! Update ControlPanel","! Update ControlPanel","! Update ControlPanel","! Set pointer on ReadMe back to top",null,{"$f":"  SET.NAME(\"Atmp3\",INDEX(NAMES(),Atmp2))","v":true},"MUM_AllelesList",{"$f":"ACTIVATE(S0con)","v":true},{"$f":"  WORKBOOK.UNHIDE(MID(S0dti,FIND(\"]\",S0dti)+1,100))","v":true},{"$f":"ERROR(FALSE)","v":true}]
["! Set the major sheetnames","Number invocations",3,{"$f":"ACTIVATE(S0con)","v":true},{"$f":"DLD_ScreenUpdateOn()","v":0},{"$f":"RUN(MUM_ConRestore,FALSE)","v":{"$error":"#N/A"}},{"$f":"ALERT(WB_0&\" has been interrupted!\"&Acar&Acar&\"Go do what you need to do and try again.\",2)","v":false},"! Check for old data","! Reset the status",{"$f":"ACTIVATE(S0con)","v":true},"! Blank any old data","! Find data","! Get rows (loci) and columns (samples)","! Find data","! Check that the data have been defined","! Tell user that the checking has begun",null,{"$f":"ACTIVATE(S0wrk)","v":true},"! Make the combined allele lists",null,{"$f":"SET.NAME(\"Atitle\",DEREF(INDIRECT(\"'\"&S0dat&\"'!\"&Arow&1&Acol&1,FALSE)))","v":true},{"$f":"SET.NAME(\"Atitle\",DEREF(INDIRECT(\"'\"&S0dat&\"'!\"&Arow&1&Acol&1,FALSE)))","v":true},{"$f":"SET.NAME(\"Atitle\",DEREF(INDIRECT(\"'\"&S0dat&\"'!\"&Arow&1&Acol&1,FALSE)))","v":true},{"$f":"SET.NAME(\"Atitle\",DEREF(INDIRECT(\"'\"&S0dat&\"'!\"&Arow&1&Acol&1,FALSE)))","v":true},{"$f":"SET.NAME(\"Nstd\",SUM(INDIRECT(\"'\"&S0wrk&\"'!\"&Arow&3&Acol&12&Asep&Arow&5&Acol&12,FALSE)))","v":true},{"$f":"RUN(MUM_ConRestore,FALSE)","v":{"$error":"#N/A"}},{"$f":"RUN(MUM_ConRestore,FALSE)","v":{"$error":"#N/A"}},{"$f":"RUN(MUM_ConRestore,FALSE)","v":{"$error":"#N/A"}},{"$f":"ERROR(FALSE)","v":true},null,{"$f":"  SET.NAME(\"Atmp4\",MATCH(Atmp3,AF:AF,0))","v":true},"MUM_Cancel",{"$f":"PAGE.SETUP(\"&L&\"\"Arial,Regular\"\"&8Built by: David Lee Duewer, NIST&C&\"\"Arial,Bold\"\"&16\"&Asyst&\"  &\"\"Arial,Regular\"\"&12<Version \"&Adate&\">\nA summariziation tool for mixed-source evidence&R&\"\"Arial,Regular\"\"&8Paid for, in part, by: NIJ\",\"&L&\"\"Arial,Regular\"\"&8&F!&A&C&\"\"Arial,Regular\"\"&8&D &T&R&\"\"Arial,Regular\"\"&8&P / &N\",0.5,0.5,1.5,0.8,FALSE,FALSE,TRUE,TRUE,2,1,TRUE,\"Auto\",1,FALSE,,0.75,0.5,FALSE,FALSE)","v":true},{"$f":"  WORKBOOK.UNHIDE(MID(S0rme,FIND(\"]\",S0rme)+1,100))","v":true},{"$f":"  WORKBOOK.UNHIDE(MID(S0rme,FIND(\"]\",S0rme)+1,100))","v":true}]
[{"$f":"SET.NAME(\"Dir_0\",GET.DOCUMENT(2))","v":true},null,null,{"$f":"SET.NAME(\"Atmp1\",DEREF(INDIRECT(\"'\"&S0mac&\"'!\"&Arow&2&Acol&3,FALSE)))","v":true},{"$f":"dld_setcolwidth(3,-1,TRUE)","v":0},{"$f":"FORMULA.GOTO(Arow&23&Acol&1,FALSE)","v":true},null,{"$f":"SET.NAME(\"Atitle\",DEREF(INDIRECT(\"'\"&S0dat&\"'!\"&Arow&1&Acol&1,FALSE)))","v":true},{"$f":"ACTIVATE(S0con)","v":true},{"$f":"FORMULA(\"Status\",INDIRECT(\"'\"&S0con&\"'!\"&\"\"&Arow&1&Acol&3,FALSE))","v":true},{"$f":"SET.NAME(\"IsFetch\",TRUE)","v":true},{"$f":"SET.NAME(\"Atype\",\"Basic\")","v":true},{"$f":"SET.NAME(\"Atype\",\"Bode\")","v":false},{"$f":"SET.NAME(\"Atype\",\"Standard\")","v":true},{"$f":"SET.NAME(\"Nrow\",COUNTA(INDIRECT(\"'\"&S0dat&\"'!\"&Acol&1,FALSE)))","v":true},{"$f":"FORMULA(\"Checking...\",INDIRECT(\"'\"&S0con&\"'!\"&Arow&2&Acol&3,FALSE))","v":true},"! Make list",{"$f":"dld_clearcols(3,5,FALSE)","v":0},{"$f":"MUM_Reportsetup(S0rp1)","v":0},{"$f":"FOR(\"Ityp\",1,2,1)","v":true},{"$f":"SET.NAME(\"Irow0\",MIN(INDIRECT(\"'\"&S0wrk&\"'!\"&Arow&3&Acol&13&Asep&Arow&5&Acol&13,FALSE)))","v":true},{"$f":"SET.NAME(\"Irow0\",MIN(INDIRECT(\"'\"&S0wrk&\"'!\"&Arow&3&Acol&13&Asep&Arow&5&Acol&13,FALSE)))","v":true},{"$f":"SET.NAME(\"Irow0\",DEREF(INDIRECT(\"'\"&S0wrk&\"'!\"&Arow&6&Acol&13,FALSE)))","v":true},{"$f":"SET.NAME(\"Irow0\",DEREF(INDIRECT(\"'\"&S0wrk&\"'!\"&Arow&2&Acol&13,FALSE)))","v":true},{"$f":"SET.NAME(\"Nevi\",DEREF(INDIRECT(\"'\"&S0wrk&\"'!\"&Arow&6&Acol&12,FALSE)))","v":true},{"$f":"FORMULA.GOTO(Arow&23&Acol&1,FALSE)","v":true},{"$f":"FORMULA.GOTO(Arow&28&Acol&1,FALSE)","v":true},{"$f":"FORMULA.GOTO(Arow&32&Acol&1,FALSE)","v":true},{"$f":"  WORKBOOK.UNHIDE(MID(S0rme,FIND(\"]\",S0rme)+1,100))","v":{"$error":"#VALUE!"}},null,{"$f":"  IF(ISERROR(Atmp4),DELETE.NAME(Atmp3))","v":false},"MUM_ConRestore",{"$f":"FORMULA.GOTO(Arow&1&Acol&1,TRUE)","v":true},{"$f":"  WORKBOOK.UNHIDE(MID(S0wrk,FIND(\"]\",S0wrk)+1,100))","v":true},{"$f":"ERROR(TRUE)","v":true}]
[{"$f":"dld_GetDefaultPath(Dir_0)","v":0},"CurZoom",95,{"$f":"IF(ISERROR(Atmp1),SET.NAME(\"Atmp1\",TRUE))","v":false},{"$f":"dld_setcolwidth(3,-1,TRUE)","v":0},{"$f":"DLD_ScreenUpdateOff()","v":0},{"$f":"HALT()","v":true},{"$f":"SET.NAME(\"Nrow\",COUNTA(INDIRECT(\"'\"&S0dat&\"'!\"&Acol&1,FALSE)))","v":true},{"$f":"dld_clearrange(3,3,Nrepsht+1,6,FALSE)","v":0},{"$f":"FORMULA(\"Date\",INDIRECT(\"'\"&S0con&\"'!\"&\"\"&Arow&1&Acol&4,FALSE))","v":true},{"$f":"RUN(\"MUM_DataClear\",FALSE)","v":{"$error":"#N/A"}},{"$f":"ACTIVATE(S1dat)","v":true},{"$f":"SET.NAME(\"Nrows\",MATCH(\"Generate CMF\",INDIRECT(\"'\"&S1dat&\"'!\"&\"\"&Acol&1,FALSE),0)-1)","v":false},{"$f":"ACTIVATE(S1dat)","v":true},{"$f":"SET.NAME(\"Nloc\",COUNTA(INDIRECT(\"'\"&S0dat&\"'!\"&Arow&4,FALSE))-2)","v":true},null,{"$f":"SET.NAME(\"Anew\",SUBSTITUTE(Atmp,\",,\",\",\"))","v":true},null,null,{"$f":"  SET.NAME(\"Anew\",EVALUATE(\"Atmp\"&Ityp))","v":true},{"$f":"SET.NAME(\"Irow1\",MAX(INDIRECT(\"'\"&S0wrk&\"'!\"&Arow&3&Acol&14&Asep&Arow&5&Acol&14,FALSE)))","v":true},{"$f":"SET.NAME(\"Irow1\",MAX(INDIRECT(\"'\"&S0wrk&\"'!\"&Arow&3&Acol&14&Asep&Arow&5&Acol&14,FALSE)))","v":true},{"$f":"SET.NAME(\"Irow1\",DEREF(INDIRECT(\"'\"&S0wrk&\"'!\"&Arow&6&Acol&14,FALSE)))","v":true},{"$f":"SET.NAME(\"Irow1\",DEREF(INDIRECT(\"'\"&S0wrk&\"'!\"&Arow&2&Acol&14,FALSE)))","v":true},{"$f":"SET.NAME(\"Ncon\",DEREF(INDIRECT(\"'\"&S0wrk&\"'!\"&Arow&2&Acol&12,FALSE)))","v":true},null,null,null,{"$f":"ERROR(TRUE)","v":true},null,{"$f":"NEXT()","v":true},"MUM_ControlAdd",null,{"$f":"ERROR(TRUE)","v":true},{"$f":"ACTIVATE(S0rme)","v":true}]
[{"$f":"SET.NAME(\"WB_0\",GET.DOCUMENT(88))","v":true},null,null,{"$f":"A1.R1C1(NOT(Atmp1))","v":true},null,null,null,{"$f":"IF(AND(LEN(Atitle)>5.5,Nrow>4.5))","v":true},null,{"$f":"FORMULA(\"Sheet\",INDIRECT(\"'\"&S0con&\"'!\"&\"\"&Arow&1&Acol&5,FALSE))","v":true},null,{"$f":"SET.NAME(\"Nrow\",dld_findrowlast())","v":true},{"$f":"SET.NAME(\"Ncols\",COUNTA(INDIRECT(\"'\"&S1dat&\"'!\"&Arow&1,FALSE))+1)","v":true},{"$f":"SET.NAME(\"Nrows\",GET.DOCUMENT(10))","v":true},{"$f":"ACTIVATE(S0con)","v":true},"! Validate the inputs",{"$f":"WHILE(NOT(ISERROR(FIND(\",,\",Anew))))","v":true},{"$f":"FORMULA(\"Type\",INDIRECT(\"'\"&S0wrk&\"'!\"&Arow&1&Acol&11,FALSE))","v":true},"! Format the header line",{"$f":"  IF(RIGHT(Anew,1)<>\",\",SET.NAME(\"Anew\",Anew&\",\"))","v":true},{"$f":"SET.NAME(\"Jrow0\",DEREF(INDIRECT(\"'\"&S0wrk&\"'!\"&Arow&6&Acol&13,FALSE)))","v":true},{"$f":"SET.NAME(\"Icol0\",MIN(INDIRECT(\"'\"&S0wrk&\"'!\"&Acol&16,FALSE)))","v":true},{"$f":"SET.NAME(\"Icol0\",MIN(INDIRECT(\"'\"&S0wrk&\"'!\"&Acol&16,FALSE)))","v":true},{"$f":"SET.NAME(\"Jrow0\",MIN(INDIRECT(\"'\"&S0wrk&\"'!\"&Arow&3&Acol&13&Asep&Arow&6&Acol&13,FALSE)))","v":true},{"$f":"SET.NAME(\"Nloc\",MAX(INDIRECT(\"'\"&S0wrk&\"'!\"&Acol&16,FALSE))-MIN(INDIRECT(\"'\"&S0wrk&\"'!\"&Acol&16,FALSE))+1)","v":true},"! Loop over Reports","! Get current Zoom","! Go to top of ReadMe",{"$f":"ACTIVATE(S0rme)","v":true},null,null,"MUM_DataCheck","! Reset the Data sheet",null,{"$f":"SELECT(\"Button 2\")","v":true}]
{"$rows_left_out":288}
{"sheet":"ReadMe","index":9,"n_rows":216,"n_cols":12,"rows_kept":216,"cut":false,"hidden":true,"merged":[[40,4,40,5],[40,7,40,8],[38,4,38,9],[206,3,206,4],[107,3,107,10],[108,3,108,10],[109,3,109,10],[110,3,110,10],[111,3,111,10],[112,3,112,10],[183,1,185,1],[197,1,197,4],[209,3,209,4],[147,3,147,5],[152,3,152,5],[199,3,199,4],[202,3,202,4]]}
[null,"Welcome to mixSTR!"]
[null,"mixSTR <Version 07-May-21>"]
[]
[null,"mixSTR is intended to help you sort out STR \"Mixture\" problems."]
[null,"mixSTR considers only the presence/absence of alleles.  It makes no use of relative signal intensity."]
["   ",null,null,null,null,null,null,null,null,null,"                                                         ","   "]
[]
[null,"ControlPanel"]
[]
[null,"The ControlPanel worksheet is where you drive the mixSTR system."]
{"$rows_left_out":207}
{"sheet":"DateTime","index":10,"n_rows":56,"n_cols":32,"rows_kept":56,"cut":false,"hidden":true,"merged":[[0,5,1,5]]}
["Parameter","Value","Format","Status",null,"Whoops… Date-Time format issue!"]
["Date","2021-05-09T18:19:13.940","dd-mmm-yy","Valid"]
["Time",44325.763355787036,"h:mm:ss","Valid",null,"Different versions of Excel support different date and time formats."]
["DateTime","2021-05-09T18:19:13.940","dd-mmm-yy h:mm:ss","Valid",null,"The default formats (in Excel-eze, \"dd-mm-yy\" and \"hh:mm:ss\") are not valid for your system.",null,null,null,null,null,null,null,null,null,null,null,null,null,null,null,null,null,null,null,null,null,null,null,null,null,"Atmp4"]
[]
[null,null,"Duewer, David L. Dr. (Fed)",null,null,"Please use Excel's standard Format menubar tool to format the contents of cells B2 and B3 (rows 2 and 3 of col 2)."]
[null,null,17,null,null,"to show the date (day, month and year) and time (hour, minute, second)."]
[null,null,null,null,null,"In the Excel system used to build this program, the date and time format tool is accessible from the"]
[null,null,null,null,null,"\"Number\" page of the \"Cells…\" entry of the \"Format\" menu of the MenuBar (Format > Cells… > Number)."]
[]
{"$rows_left_out":47}
{"sheet":"Work","index":11,"n_rows":18,"n_cols":22,"rows_kept":18,"cut":false,"hidden":true,"merged":[]}
["1",null,null,null,12,11,12,11,null,null,"Type","#","Rfst","Rlst",null,"Col","Locus",null,null,null,"Abb","Type"]
["2",null,null,null,13,null,13,null,null,null,"Control",null,null,null,null,null,null,null,null,null,"Bla","Blank"]
["3",null,null,null,null,null,null,null,null,null,"Xclude",null,null,null,null,null,null,null,null,null,"Con","Control"]
["4",null,null,null,null,null,null,null,null,null,"Victim",null,null,null,null,null,null,null,null,null,"Dis","Disabled"]
["5",null,null,null,null,null,null,null,null,null,"Suspect",null,null,null,null,null,null,null,null,null,"Evi","Evidence"]
["6",null,null,null,null,null,null,null,null,null,"Evidence",null,null,null,null,null,null,null,null,null,"Exc","Xclude"]
["7",null,null,null,null,null,null,null,null,null,"Blank",null,null,null,null,null,null,null,null,null,"Mix","Evidence"]
["8",null,null,null,null,null,null,null,null,null,null,null,null,null,null,null,null,null,null,null,"Sus","Suspect"]
["9",null,null,null,null,null,null,null,null,null,null,null,null,null,null,null,null,null,null,null,"Vic","Victim"]
["0",null,null,null,null,null,null,null,null,null,null,null,null,null,null,null,null,null,null,null,"Xcl","Xclude"]
{"$rows_left_out":8}