{"text_format":"1","workbook":"xlsx","n_sheets":11,"sheets":["ControlPanel","InData1","InData2","Report","Introduction","ReadMe","VMM_Macro","OutData","BugList","WrkInfo","WrkTmp"],"not_rendered":{"charts":0,"images":0,"macros":1,"external_links":0,"defined_names":161,"comments":0,"pivot_tables":0},"unopened":[],"bounds":{"document_bytes":16777216,"sheet_cells":100000,"rows_first":2000,"rows_last":500,"rows_between":2000,"halvings":0,"cell_chars":16384,"cell_head_chars":4096},"cells_cut":0,"cells_raw":0,"read":"whole","date_system":"1900"}

{"sheet":"ControlPanel","index":0,"n_rows":51,"n_cols":15,"rows_kept":51,"cut":false,"hidden":false,"merged":[[10,0,11,0],[0,8,0,9],[5,11,5,13],[0,3,0,6],[0,0,1,0],[38,0,39,0],[5,3,5,6],[11,3,11,6],[35,0,36,0],[27,0,28,0],[31,0,32,0],[13,0,14,0],[17,0,18,0],[20,0,21,0],[23,0,24,0],[4,0,5,0],[7,0,8,0]]}
[null,null,null,"Status of Report Sheet",null,null,null,null,"Numbers"]
[null,null,null,"Status","Last Mixed","Sheet","Contents",null,"#Loci","# Profiles"]
[null,null,null,"Clear","2014-05-28T14:05:35.170","Report","Two-donor mixtures for all profile pairs",null,0,0]
[]
[]
[null,null,null,"Status of Data Sheets",null,null,null,null,null,null,null,"# Deleted Records",null,null,"#"]
[null,null,null,"Status","Last Modified","Sheet","Contents",null,"#Loci","# Profiles",null,"Incmpl","Dups","Reps","Renamed"]
[null,null,null,"Clear","2014-05-28T14:05:35.340","InData1","Comma-delimited single-donor STR-profiles",null,0,0]
[null,null,null,"Clear","2014-05-28T14:05:35.340","InData2","Comma-delimited single-donor STR-profiles",null,0,0]
[]
[]
[null,null,null,"Workbooks Accessed"]
[null,null,null,"Used","When Accessed","Workbook","Directory",null,"#Loci","# Profiles"]
[]
[]
{"$rows_left_out":37}
{"sheet":"InData1","index":1,"n_rows":0,"n_cols":0,"rows_kept":0,"cut":false,"hidden":false,"merged":[]}

{"sheet":"InData2","index":2,"n_rows":0,"n_cols":0,"rows_kept":0,"cut":false,"hidden":false,"merged":[]}

{"sheet":"Report","index":3,"n_rows":0,"n_cols":0,"rows_kept":0,"cut":false,"hidden":false,"merged":[]}

{"sheet":"Introduction","index":4,"n_rows":45,"n_cols":4,"rows_kept":45,"cut":false,"hidden":false,"merged":[[44,3,48,4],[7,3,7,4],[32,2,32,4],[16,2,16,4],[38,3,40,4],[15,2,15,4],[18,2,18,4],[17,2,17,4],[37,3,37,4],[0,0,35,0],[33,3,36,4],[20,3,21,3],[23,2,23,4],[25,3,27,3],[11,2,11,4],[13,2,13,4],[14,2,14,4],[0,2,0,4],[1,2,1,4],[2,2,2,4],[12,2,12,4],[10,2,10,4],[4,2,4,4],[6,3,6,4],[8,3,8,4]]}
["STR_VirtualMixtureMaker was developed by David Duewer, Analytical Chemical Division, NIST,\nwith advice and support from the Human Identity Project, Biochemical Science Division.",null,"Welcome to STR_VirtualMixtureMaker!"]
[]
[null,null,"STR_VirtualMixtureMaker creates and evaluates pair-wise mixture combinations of STR profiles."]
[]
[null,null,"Profiles stored in either the NIST standard and/or compact formats (see STR_ConvertFormats) can be used to create the profile list."]
[]
[null,null,"Outputs results include: ","a list of two-donor mixture profiles with the least number of alleles in common"]
[null,null,null,"a list of two-donor mixture profiles with the greatest number of alleles in common"]
[null,null,null,"a list of all two-donor mixture profiles"]
[]
[null,null,"Problems?"]
[null,null,"This is the first release: there will be problems!"]
[null,null,"Please repeat whatever caused the blowup a couple of times and note down all symptoms and error messages."]
[null,null,"Email the description to david.duewer@nist.gov"]
[]
{"$rows_left_out":31}
{"sheet":"ReadMe","index":5,"n_rows":78,"n_cols":10,"rows_kept":78,"cut":false,"hidden":false,"merged":[[25,3,25,15],[21,3,21,15],[56,1,56,15],[2,3,2,15],[3,3,3,15],[6,3,6,15],[7,3,7,15],[5,3,5,15],[4,3,4,15],[15,3,15,15],[28,3,28,15],[26,3,26,15],[27,3,27,15],[10,3,10,15],[11,3,11,15],[16,3,16,15],[17,3,17,15],[12,3,12,15],[55,1,55,15],[65,3,65,15],[32,1,32,15],[33,1,33,15],[34,1,34,15],[35,1,35,15],[36,1,36,15],[47,1,47,13],[53,1,53,15],[49,1,49,15],[57,1,57,15],[52,1,52,15],[62,1,62,15],[61,1,61,15],[59,1,59,15],[58,1,58,15],[22,3,22,15],[23,3,23,15],[0,0,0,16],[50,1,50,15],[51,1,51,15],[37,3,37,15],[8,3,8,15],[9,3,9,15],[29,3,29,15],[30,3,30,15],[20,3,20,15],[13,3,13,15],[14,3,14,15],[18,3,18,15],[19,3,19,15],[24,3,24,15]]}
["  "]
[]
[null,"ControlPanel Commands",null,"ControlPanel Summary Information"]
[null,"All of the STR_VirtualMixtureMaker commands are accessed from the ControlPanel worksheet.",null,"There are three information \"blocks\" in the ControlPanel worksheet:"]
[null,null,null,"  Status of Report Sheets"]
[null,"There are currently twelve commands, each accessed from it's own Command Button:",null,"      Status: Either \"Clear\", \"Processing\", or \"Finished\".  You can only print \"Finished\" report sheets."]
[null,"  ReadMe: Brings you to this page",null,"      Last Mixed: The datetime of the last action affecting the report."]
[null,null,null,"      Sheet: The name of the report sheet."]
[null,"  Clear: Clears all status reports and working data.",null,"      Contents: A brief description of what the report will contain when it is \"Finished\"."]
[null,"  Add Data1: Adds the profiles on a specified sheet to worksheet Data1.",null,"      #Loci: The number of loci in the mixture profiles."]
[null,"  Add Data2: Adds the profiles on a specified sheet to worksheet Data2.",null,"      #Profiles: The number of mixture profiles in the report."]
[null,"  Check: Makes sure that all alleles on sheets Data1 and Data2 have been validly and completely specified."]
[null,null,null,"  Status of Data Sheets"]
[null,"  Mix1: Makes all the non-self binary mixtures of the profiles on sheet Data1.",null,"      Status: Either \"Clear\", \"Loaded\", \"Checking\", or \"Checked\".  You can only make mixtures after the data sheets have been \"Checked\"."]
[null,"  Mix2: Makes all the non-self binary mixtures of the profiles on sheet Data2.",null,"      Last Mixed: The datetime of the last action affecting the data."]
{"$rows_left_out":64}
{"sheet":"VMM_Macro","index":6,"n_rows":361,"n_cols":38,"rows_kept":361,"cut":false,"hidden":false,"merged":[]}
["AutoCall_Globals","Parameter","Value","AutoCall_GotoControl","AutoCall_GotoIntroduction","VMM_AddData","VMM_AddDriver","VMM_AddDriver1","VMM_AddDriver2","VMM_AddSheet","VMM_Cancel","VMM_CheckDataUser","VMM_ClearAll","VMM_CountData","VMM_GotoReadMeFancy","VMM_GotoReadMePlain","VMM_MakeMix1","VMM_MakeMix2","VMM_MakeMixtures","VMM_MakeMix12","VMM_MakeProfile","VMM_ReportClear","VMM_ReportFormat","VMM_ReportHeader","VMM_Store","VMM_Print","VMM_Zoom",null,"Utility(CleanUpNames)","Atmp1","Utility_ResetHeaders","Utility_AlignControls",null,null,"Utility_Colors",1,null,1]
["! In the normal course of events, this is ONLY run by the Auto_Open VBA Macro","R1C1 mode",true,"! Take user to the Control worksheet","! Take a new user to the Introduction worksheet","! Get the names and alleles for the samples from this worksheet","! Load Profiles","! Load Profiles onto Data1","! Load Profiles onto Data1","! Get the data from one worksheet","! Take care of User interruptions","! Check the structure and all of the profiles","! Clear everything","! Get current Counts","! Take user to the ReadMe worksheet, no nonsence","! Take user to the ReadMe worksheet, no nonsence","! Make the three reports for Data1","! Make the three reports for Data2","! Make the three reports for InData1 of InData2","! Make the three reports for Data1 x Data2","! Blend two specified profiles","! Clear the report sheets","! Clear everything","! Put in the headers","! Store the \"All Pairs\" mixtures","! Print active sheet","! Set the default zoom",null,{"$f":"MESSAGE(TRUE,TEXT(NOW(),AlngDatTim)&\" \"&AC$1)","v":true},"Atmp2","! Reset Page Headers of visible files","! Make sure the buttons are in the right spot",null,null,"! List the colors",2,null,2]
["! If you diddle any of the constants, make sure you re-run it yourself before you evaluate the diddle","Calculation mode",-4105,{"$f":"ECHO(FALSE)","v":true},{"$f":"MESSAGE(TRUE,TEXT(NOW(),AlngDatTim)&\" \"&E$1)","v":true},{"$f":"MESSAGE(TRUE,TEXT(NOW(),AlngDatTim)&\" \"&F$1)","v":true},{"$f":"MESSAGE(TRUE,TEXT(NOW(),AlngDatTim)&\" \"&G$1)","v":true},{"$f":"MESSAGE(TRUE,TEXT(NOW(),AlngDatTim)&\" \"&H$1)","v":true},{"$f":"MESSAGE(TRUE,TEXT(NOW(),AlngDatTim)&\" \"&I$1)","v":true},{"$f":"MESSAGE(TRUE,TEXT(NOW(),AlngDatTim)&\" \"&J$1)","v":true},{"$f":"ECHO(FALSE)","v":true},{"$f":"FOR(\"Idat\",1,2,1)","v":true},{"$f":"MESSAGE(TRUE,TEXT(NOW(),AlngDatTim)&\" \"&M$1)","v":true},{"$f":"MESSAGE(TRUE,TEXT(NOW(),AlngDatTim)&\" \"&N$1)","v":true},{"$f":"MESSAGE(TRUE,TEXT(NOW(),AlngDatTim)&\" \"&O$1)","v":true},{"$f":"MESSAGE(TRUE,TEXT(NOW(),AlngDatTim)&\" \"&P$1)","v":true},{"$f":"MESSAGE(TRUE,TEXT(NOW(),AlngDatTim)&\" \"&Q$1)","v":true},{"$f":"MESSAGE(TRUE,TEXT(NOW(),AlngDatTim)&\" \"&R$1)","v":true},{"$f":"MESSAGE(TRUE,TEXT(NOW(),AlngDatTim)&\" \"&S$1)","v":true},{"$f":"MESSAGE(TRUE,TEXT(NOW(),AlngDatTim)&\" \"&T$1)","v":true},{"$f":"MESSAGE(TRUE,TEXT(NOW(),AlngDatTim)&\" \"&U$1)","v":true},{"$f":"MESSAGE(TRUE,TEXT(NOW(),AlngDatTim)&\" \"&V$1)","v":true},{"$f":"MESSAGE(TRUE,TEXT(NOW(),AlngDatTim)&\" \"&W$1)","v":true},{"$f":"MESSAGE(TRUE,TEXT(NOW(),AlngDatTim)&\" \"&X$1)","v":true},{"$f":"MESSAGE(TRUE,TEXT(NOW(),AlngDatTim)&\" \"&Y$1)","v":true},{"$f":"MESSAGE(TRUE,TEXT(NOW(),AlngDatTim)&\" \"&Z$1)","v":true},{"$f":"MESSAGE(TRUE,TEXT(NOW(),AlngDatTim)&\" \"&AA$1)","v":true},null,null,"Atmp3",{"$f":"MESSAGE(TRUE,TEXT(NOW(),AlngDatTim)&\"  \"&AE$1)","v":true},{"$f":"MESSAGE(TRUE,TEXT(NOW(),AlngDatTim)&\"  \"&AF$1)","v":true},null,null,{"$f":"MESSAGE(TRUE,TEXT(NOW(),AlngDatTim)&\"  \"&AI$1)","v":true},3,null,3]
[{"$f":"SET.NAME(\"Asyst\",\"STR_VirtualMixtureMaker\")","v":true},"Start datetime","2014-05-28T11:23:32",null,{"$f":"ECHO(FALSE)","v":true},{"$f":"ECHO(FALSE)","v":true},{"$f":"ECHO(FALSE)","v":true},{"$f":"ECHO(FALSE)","v":true},{"$f":"ECHO(FALSE)","v":true},{"$f":"ECHO(TRUE)","v":true},{"$f":"ACTIVATE(S0con)","v":true},{"$f":"  SET.NAME(\"Atmp1\",DEREF(INDIRECT(\"'\"&S0con&\"'!\"&Arow&RowDat-Idat+1&Acol&4,FALSE)))","v":true},{"$f":"ECHO(FALSE)","v":true},{"$f":"ECHO(FALSE)","v":true},{"$f":"ECHO(FALSE)","v":true},{"$f":"ECHO(FALSE)","v":true},{"$f":"ECHO(FALSE)","v":true},{"$f":"ECHO(FALSE)","v":true},{"$f":"ECHO(FALSE)","v":true},{"$f":"ECHO(FALSE)","v":true},{"$f":"ECHO(FALSE)","v":true},{"$f":"ECHO(FALSE)","v":true},{"$f":"ECHO(FALSE)","v":true},{"$f":"ECHO(FALSE)","v":true},{"$f":"ECHO(FALSE)","v":true},{"$f":"ECHO(FALSE)","v":true},{"$f":"ECHO(FALSE)","v":true},null,"! Get rid of all the transcients","AutoCall_Globals",{"$f":"ECHO(FALSE)","v":true},{"$f":"ECHO(FALSE)","v":true},null,null,null,4,null,4]
[{"$f":"SET.NAME(\"Avers\",\"27-May-14\")","v":true},null,"02:42:14",{"$f":"ACTIVATE(S0con)","v":true},null,null,null,null,null,null,null,{"$f":"  IF(Atmp1=\"Checked\",FORMULA(\"ForceCheck\",INDIRECT(\"'\"&S0con&\"'!\"&Arow&RowDat-Idat+1&Acol&4,FALSE)))","v":false},null,null,null,null,null,null,null,null,null,null,null,null,null,null,null,null,{"$f":"SET.NAME(\"Atmp1\",COUNTA(NAMES()))","v":true},"AutoCall_GotoControl",{"$f":"SET.NAME(\"Atmp\",\"A System for Mixing Pairs of STR Profiles\")","v":true},null,null,null,{"$f":"ACTIVATE(S0mac)","v":true},5,null,5]
[{"$f":"SET.NAME(\"Aprog\",Asyst&\" <Version: \"&Avers&\">\")","v":true},null,"Duewer, David L. Dr.",{"$f":"dld_setcolwidth(1,-1,TRUE)","v":0},"! Make sure Intro is in right format","! Loop over the samples","! Set up loci tracker","! Set sheet to Data1","! Set sheet to Data2","! Find the new  file",{"$f":"dld_setcolwidth(4,-1,TRUE)","v":false},{"$f":"NEXT()","v":true},"! Clear control panel","! Loop over both sheets","! Make sure Intro is in right format","! Make sure Intro is in right format","! Confirm that there is checked data","! Confirm that there is checked data","! Set up same-sheet analysis","! Set up same-sheet analysis","! Clear the temporary workspace","! Clear control panel","! Sort","! Update status","! Check if it is ready","! Check if it is ready",{"$f":"ACTIVATE(S0con)","v":true},null,{"$f":"FOR(\"Atmp2\",Atmp1,1,-1)","v":true},"AutoCall_GotoIntroduction",null,"! Make sure globals are defined",null,null,{"$f":"FORMULA.GOTO(\"R1C[1]\",TRUE)","v":true},6,null,6]
[{"$f":"MESSAGE(FALSE)","v":true},null,"1900-01-05",{"$f":"FORMULA.GOTO(Arow&BRow_clr&Acol&1,FALSE)","v":true},{"$f":"ACTIVATE(S0int)","v":true},{"$f":"SET.NAME(\"Asht\",MID(S1dat,FIND(\"]\",S1dat)+1,100))","v":true},{"$f":"ACTIVATE(S0win)","v":true},{"$f":"SET.NAME(\"S0dat\",S0da1)","v":true},{"$f":"SET.NAME(\"S0dat\",S0da2)","v":true},{"$f":"SET.NAME(\"Afile\",OPEN.DIALOG(,,\"Please select the desired file.\"))","v":true},{"$f":"FORMULA.GOTO(Arow&Igoto&Acol&1,FALSE)","v":true},null,{"$f":"ACTIVATE(S0con)","v":true},{"$f":"FOR(\"Idat\",1,2,1)","v":true},{"$f":"ACTIVATE(S0int)","v":true},{"$f":"ACTIVATE(S0int)","v":true},{"$f":"SET.NAME(\"Atmp\",DEREF(INDIRECT(\"'\"&S0con&\"'!\"&Arow&RowDat&Acol&4,FALSE)))","v":true},{"$f":"SET.NAME(\"Atmp\",DEREF(INDIRECT(\"'\"&S0con&\"'!\"&Arow&RowDat+1&Acol&4,FALSE)))","v":true},{"$f":"SET.NAME(\"S0dat1\",S0dat)","v":true},{"$f":"SET.NAME(\"S0dat1\",S0da1)","v":true},{"$f":"ACTIVATE(S0win)","v":true},{"$f":"ACTIVATE(S0con)","v":true},{"$f":"ACTIVATE(S0rep)","v":true},{"$f":"SET.NAME(\"Nloc\",COUNTA(INDIRECT(\"'\"&S0win&\"'!\"&Acol&11,FALSE)))","v":true},{"$f":"SET.NAME(\"Atmp\",DEREF(INDIRECT(\"'\"&S0con&\"'!\"&Arow&Rowrep&Acol&4,FALSE)))","v":true},{"$f":"SET.NAME(\"Atmp\",DEREF(INDIRECT(\"'\"&S0con&\"'!\"&Arow&3&Acol&4,FALSE)))","v":true},{"$f":"FORMULA.GOTO(Arow&1&Acol&1,TRUE)","v":true},null,{"$f":"  SET.NAME(\"Atmp3\",INDEX(NAMES(),Atmp2))","v":true},"VMM_AddData","! Make sure globals are defined",{"$f":"RUN(AutoCall_Globals,FALSE)","v":{"$error":"#N/A"}},null,null,{"$f":"FOR(\"Itmp\",1,56,1)","v":true},7,null,7]
[{"$f":"ECHO(FALSE)","v":true},null,null,null,{"$f":"FORMULA.GOTO(Arow&1&Acol&1,TRUE)","v":true},{"$f":"SET.NAME(\"Nsam\",COUNTA(INDIRECT(\"'\"&S0dat&\"'!\"&Acol&2,FALSE))-1)","v":true},{"$f":"SELECT(INDIRECT(\"'\"&S0win&\"'!\"&Acol&3&Asep&Acol&7,FALSE))","v":true},{"$f":"SET.NAME(\"Igoto\",BRow_ad1)","v":true},{"$f":"SET.NAME(\"Igoto\",BRow_ad2)","v":true},{"$f":"IF(ISERROR(Afile),SET.NAME(\"Afile\",FALSE))","v":false},null,null,{"$f":"dld_clearrange(Rowrep,4,Rowrep,5)","v":0},{"$f":"  SET.NAME(\"S0tmp\",EVALUATE(\"S0da\"&Idat))","v":true},{"$f":"FORMULA.GOTO(Arow&1&Acol&1,TRUE)","v":true},{"$f":"FORMULA.GOTO(Arow&1&Acol&1,TRUE)","v":true},{"$f":"IF(Atmp<>\"Checked\",RUN(VMM_CheckData,FALSE))","v":{"$error":"#N/A"}},{"$f":"IF(Atmp<>\"Checked\",RUN(VMM_CheckData,FALSE))","v":{"$error":"#N/A"}},{"$f":"SET.NAME(\"S0dat2\",S0dat)","v":true},{"$f":"SET.NAME(\"S0dat2\",S0da2)","v":true},{"$f":"dld_clearcols(21,-1)","v":0},{"$f":"dld_clearrange(Rrowrep,4,Rowrep,5)","v":{"$error":"#VALUE!"}},{"$f":"dld_selectrange(5,1,-1,-1)","v":0},{"$f":"FORMULA(\"Processing\",INDIRECT(\"'\"&S0con&\"'!\"&Arow&Rowrep&Acol&4,FALSE))","v":true},{"$f":"IF(Atmp<>\"Finished\")","v":true},{"$f":"IF(Atmp<>\"Finished\")","v":true},{"$f":"FORMULA.GOTO(Arow&BRow_zom&Acol&1,FALSE)","v":true},null,{"$f":"  IF(ISERROR(MATCH(Atmp3,AD:AD,0)),DELETE.NAME(Atmp3))","v":true},"VMM_AddDriver",{"$f":"RUN(AutoCall_Globals,FALSE)","v":{"$error":"#N/A"}},null,null,null,{"$f":"  FORMULA(Itmp,INDIRECT(\"'\"&S0mac&\"'!R\"&Itmp&\"C[1]\",FALSE))","v":true},8,null,8]
[null,"Stop datetime","01:31:33",{"$f":"RETURN()","v":true},{"$f":"FORMULA.GOTO(Arow&27&Acol&4,FALSE)","v":true},{"$f":"SET.NAME(\"Nunk\",0)","v":true},{"$f":"CLEAR(3)","v":true},null,null,{"$f":"IF(Afile=FALSE)","v":true},{"$f":"ECHO(TRUE)","v":true},"VMM_CheckData",{"$f":"dld_clearrange(Rowrep,9,Rowrep,-1)","v":0},null,{"$f":"FORMULA.GOTO(Arow&27&Acol&4,FALSE)","v":true},{"$f":"FORMULA.GOTO(Arow&27&Acol&4,FALSE)","v":true},null,null,null,null,null,null,{"$f":"SORT(1,Arow&5&Acol&5,1,Arow&5&Acol&8,1,Arow&5&Acol&9,1,2)","v":true},{"$f":"FORMULA(NOW(),INDIRECT(\"'\"&S0con&\"'!\"&Arow&Rowrep&Acol&5,FALSE))","v":true},{"$f":"  SET.NAME(\"Atmp1\",MID(S0rep,FIND(\"]\",S0rep)+1,100))","v":true},{"$f":"  SET.NAME(\"Atmp1\",MID(S0rep,FIND(\"]\",S0rep)+1,100))","v":true},null,null,{"$f":"NEXT()","v":true},"VMM_AddDriver1",null,"! Clear the sheets",null,null,{"$f":"  SELECT(INDIRECT(\"'\"&S0mac&\"'!R\"&Itmp&\"C[2]\",FALSE))","v":true},9,null,9]
["! Make sheetnames","User","DLDuewer",null,null,{"$f":"ACTIVATE(S0dat)","v":true},{"$f":"FORMULA(\"Locus\",INDIRECT(\"'\"&S0win&\"'!\"&Arow&1&Acol&3,FALSE))","v":true},"! Run the driver","! Run the driver",{"$f":"  SET.NAME(\"Npro\",COUNTA(INDIRECT(\"'\"&S0dat&\"'!\"&Acol&2,FALSE))-1)","v":true},{"$f":"ALERT(\"You have interrupted \"&Asyst&\".\"&Achr&\"The message line lists the system's current status.\"&Achr&Achr&\"Go do what you need to do and try again.\",2)","v":true},"! Check the structure and all of the profiles",{"$f":"dld_clearrange(RowDat,4,RowDat+3,5)","v":0},"! Count loci",null,null,"! Set parameters","! Set parameters","! Clear the report sheets","! Confirm that there is checked data",null,null,null,{"$f":"FORMULA(Nloc,INDIRECT(\"'\"&S0con&\"'!\"&Arow&Rowrep&Acol&9,FALSE))","v":true},{"$f":"  ACTIVATE(S0con)","v":true},{"$f":"  ACTIVATE(S0con)","v":true},"! Get current Zoom",null,null,"VMM_AddDriver2","! Reset Readme",{"$f":"RUN(VMM_ClearAll,FALSE)","v":{"$error":"#N/A"}},null,null,{"$f":"  PATTERNS(1,1,Itmp,TRUE)","v":true},10,null,10]
[{"$f":"SET.NAME(\"Dir_0\",GET.DOCUMENT(2))","v":true},"Number invocations",12,null,{"$f":"MESSAGE(TRUE,TEXT(NOW(),AlngDatTim)&\" \"&E$1&\" > Finished.\")","v":true},{"$f":"FOR(\"Irow\",RowHed+1,RowLst,1)","v":true},{"$f":"FORMULA(\"#\",INDIRECT(\"'\"&S0win&\"'!\"&Arow&1&Acol&4,FALSE))","v":true},{"$f":"RUN(VMM_AddDriver,FALSE)","v":{"$error":"#N/A"}},{"$f":"RUN(VMM_AddDriver,FALSE)","v":{"$error":"#N/A"}},{"$f":"  MESSAGE(TRUE,TEXT(NOW(),AlngDatTim)&\" \"&J$1&\" > Browsing aborted by user.\")","v":true},{"$f":"HALT()","v":true},{"$f":"MESSAGE(TRUE,TEXT(NOW(),AlngDatTim)&\"  \"&L$9)","v":true},{"$f":"dld_clearrange(RowDat,9,RowDat+3,-1)","v":0},{"$f":"  SET.NAME(\"Itmp\",COUNTA(INDIRECT(\"'\"&S0tmp&\"'!\"&Arow&4,FALSE))-8)","v":true},"! Goto Readme","! Goto Readme",{"$f":"SET.NAME(\"S0dat\",S0da1)","v":true},{"$f":"SET.NAME(\"S0dat\",S0da2)","v":true},{"$f":"RUN(VMM_ReportClear,FALSE)","v":{"$error":"#N/A"}},{"$f":"SET.NAME(\"Atmp1\",DEREF(INDIRECT(\"'\"&S0con&\"'!\"&Arow&RowDat&Acol&4,FALSE)))","v":true},"! Strip sample names from 1st record","! Clear the report sheet","! Format",{"$f":"FORMULA(\"\",INDIRECT(\"'\"&S0con&\"'!\"&Arow&Rowrep&Acol&10,FALSE))","v":true},{"$f":"  MESSAGE(TRUE,TEXT(NOW(),AlngDatTim)&\" Error… The report sheet (\"&Atmp1&\") has not been finished.\")","v":true},{"$f":"  MESSAGE(TRUE,TEXT(NOW(),AlngDatTim)&\" Error… The report sheet (\"&Atmp1&\") has not been finished.\")","v":true},{"$f":"SET.NAME(\"CurZoom\",DEREF(INDIRECT(\"'\"&S0mac&\"'!\"&Arow&13&Acol&3,FALSE)))","v":true},null,"! Restore Globals","VMM_AddSheet",{"$f":"ACTIVATE(S0rme)","v":true},null,null,null,{"$f":"  SET.NAME(\"Jtmp\",GET.CELL(63,INDIRECT(\"'\"&S0mac&\"'!R\"&Itmp&\"C[2]\",FALSE)))","v":true},11,null,11]
[{"$f":"SET.NAME(\"WrkBk_0\",GET.DOCUMENT(88))","v":true},null,null,null,{"$f":"RETURN()","v":true},{"$f":"  SET.NAME(\"Atmp2\",COUNTA(INDIRECT(\"'\"&S1dat&\"'!\"&Arow&Irow,FALSE)))","v":true},{"$f":"FORMULA(\"InCol\",INDIRECT(\"'\"&S0win&\"'!\"&Arow&1&Acol&5,FALSE))","v":true},null,null,{"$f":"  ACTIVATE(S0con)","v":true},null,{"$f":"ECHO(FALSE)","v":true},{"$f":"dld_clearrange(RowFil,4,-1,-1)","v":0},{"$f":"  FORMULA(MAX(0,Itmp),INDIRECT(\"'\"&S0con&\"'!\"&Arow&RowDat-1+Idat&Acol&9,FALSE))","v":true},{"$f":"ACTIVATE(S0rme)","v":true},{"$f":"ACTIVATE(S0rme)","v":true},{"$f":"SET.NAME(\"Igoto\",BRow_mx1)","v":true},{"$f":"SET.NAME(\"Igoto\",BRow_mx2)","v":true},{"$f":"RUN(VMM_CountData,FALSE)","v":{"$error":"#N/A"}},{"$f":"SET.NAME(\"Atmp2\",DEREF(INDIRECT(\"'\"&S0con&\"'!\"&Arow&RowDat+1&Acol&4,FALSE)))","v":true},{"$f":"SET.NAME(\"Asam\",DEREF(INDIRECT(\"'\"&S0dat1&\"'!\"&Arow&Irow&Acol&2,FALSE)))","v":true},{"$f":"ACTIVATE(S0rep)","v":true},{"$f":"dld_setcolwidth(1,-1,TRUE)","v":0},null,{"$f":"  FORMULA.GOTO(Arow&1&Acol&1,TRUE)","v":true},{"$f":"  FORMULA.GOTO(Arow&1&Acol&1,TRUE)","v":true},{"$f":"IF(ISERROR(1/CurZoom),SET.NAME(\"CurZoom\",0))","v":false},null,{"$f":"RUN(AutoCall_Globals,FALSE)","v":{"$error":"#N/A"}},"VMM_Cancel",{"$f":"PAGE.SETUP(\"&L&\"\"Arial,Regular\"\"&8Built by: DL Duewer, NIST&C&\"\"Arial,Bold\"\"&16\"&Asyst&\" &\"\"Arial,Regular\"\"&12<\"&Avers&\">\n\"&Atmp&\"&R&\"\"Arial,Regular\"\"&8Paid for, in part, by: NIJ\",\"&L&\"\"Arial,Regular\"\"&8&F!&A&C&\"\"Arial,Regular\"\"&8&D &T&R&\"\"Arial,Regular\"\"&8&P / &N\",0.5,0.25,1.1,0.5,FALSE,FALSE,TRUE,FALSE,2,1,{1,1},\"Auto\",1,FALSE,,0.7,0.3,FALSE,FALSE)","v":true},"! Format the Introduction",null,null,{"$f":"  FORMULA(Jtmp,INDIRECT(\"'\"&S0mac&\"'!R\"&Itmp&\"C[3]\",FALSE))","v":true},12,null,12]
[{"$f":"SET.NAME(\"S0con\",\"[\"&WrkBk_0&\"]ControlPanel\")","v":true},"CurZoom",100,null,null,{"$f":"  IF(Atmp2>0.5)","v":true},{"$f":"FORMULA(\"OutCol\",INDIRECT(\"'\"&S0win&\"'!\"&Arow&1&Acol&6,FALSE))","v":true},"! Update the data counts","! Update the data counts",{"$f":"  FORMULA.GOTO(Arow&1&Acol&1,TRUE)","v":true},null,null,{"$f":"dld_clearcols(16,-1)","v":0},null,{"$f":"FORMULA.GOTO(Arow&1&Acol&1,TRUE)","v":true},{"$f":"FORMULA.GOTO(Arow&1&Acol&1,TRUE)","v":true},null,null,null,{"$f":"IF(OR(Atmp1<>\"Checked\",Atmp2<>\"Checked\"),RUN(VMM_CheckData,FALSE))","v":false},{"$f":"SET.NAME(\"Itmp1\",0)","v":true},{"$f":"dld_clearcols(1,-1)","v":0},null,"! Select and clear sheet",{"$f":"  FORMULA.GOTO(Arow&BRow_clr&Acol&1,FALSE)","v":true},{"$f":"  FORMULA.GOTO(Arow&BRow_clr&Acol&1,FALSE)","v":true},{"$f":"IF(OR(CurZoom<30,CurZoom>200),SET.NAME(\"CurZoom\",75))","v":false},null,null,"VMM_CheckData",{"$f":"FORMULA.GOTO(Arow&1&Acol&1,TRUE)","v":true},{"$f":"ACTIVATE(S0int)","v":true},null,null,{"$f":"NEXT()","v":true},13,null,13]
[{"$f":"SET.NAME(\"S0da1\",\"[\"&WrkBk_0&\"]InData1\")","v":true},null,null,null,null,{"$f":"    SET.NAME(\"Nsam\",Nsam+1)","v":true},{"$f":"FORMULA(\"Status\",INDIRECT(\"'\"&S0win&\"'!\"&Arow&1&Acol&7,FALSE))","v":true},{"$f":"FORMULA(\"Loaded\",INDIRECT(\"'\"&S0con&\"'!\"&Arow&RowDat&Acol&4,FALSE))","v":true},{"$f":"FORMULA(\"Loaded\",INDIRECT(\"'\"&S0con&\"'!\"&Arow&RowDat+1&Acol&4,FALSE))","v":true},{"$f":"  FORMULA.GOTO(Arow&IF(Npro<0.5,BRow_clr,Igoto)&Acol&1,FALSE)","v":true},null,"! Loop over both data sheets",{"$f":"SET.NAME(\"ALastMix\",\"Clear\")","v":true},"! Count profiles",{"$f":"ECHO(TRUE)","v":true},null,"! Make the mixtures","! Make the mixtures","! Check if all is good to go",null,{"$f":"SET.NAME(\"Atmp1\",SUBSTITUTE(SUBSTITUTE(Asam,\"{\",\"\"),\"}\",\"\")&\";\")","v":true},{"$f":"FORMULA(\"Clear\",INDIRECT(\"'\"&S0con&\"'!\"&Arow&Rowrep&Acol&4,FALSE))","v":true},"! Report",{"$f":"ACTIVATE(S0rep)","v":true},{"$f":"  ECHO(TRUE)","v":true},{"$f":"  ECHO(TRUE)","v":true},null,null,"! Return here","VMM_CheckDataUser",null,{"$f":"SELECT(\"Button 1\")","v":true},null,null,{"$f":"SELECT(\"C[1]:C[3]\")","v":true},14,null,14]
[{"$f":"SET.NAME(\"S0da2\",\"[\"&WrkBk_0&\"]InData2\")","v":true},null,null,null,null,{"$f":"    IF(MOD(Nsam,2)=1,MESSAGE(TRUE,TEXT(NOW(),AlngDatTim)&\" \"&F$1&\" > Processing \"&Irow-RowHed&\" / \"&RowLst-RowHed))","v":true},"! Store loci, if any are defined",{"$f":"FORMULA(NOW(),INDIRECT(\"'\"&S0con&\"'!\"&Arow&RowDat&Acol&5,FALSE))","v":true},{"$f":"FORMULA(NOW(),INDIRECT(\"'\"&S0con&\"'!\"&Arow&RowDat+1&Acol&5,FALSE))","v":true},{"$f":"  ALERT(\"No data file was specified.\"&Achr&Achr&\"Please do whatever you need to do and try again.\",2)","v":true},null,{"$f":"FOR(\"Idat\",1,2,1)","v":true},null,{"$f":"  SET.NAME(\"Itmp\",COUNTA(INDIRECT(\"'\"&S0tmp&\"'!\"&Acol&2,FALSE))-1)","v":true},{"$f":"ALERT(\"This worksheet is the 'Instruction Manual' for this system.\"&Achr&Achr&\"Click 'OK', survey the information, then go to the ControlPanel and get started.\"&Achr&\"When you encounter hassles, return here and read the relevant bits more thoroughly.\",2)","v":true},{"$f":"MESSAGE(TRUE,TEXT(NOW(),AlngDatTim)&\" \"&P$1&\" > Finished.\")","v":true},{"$f":"SET.NAME(\"ALastMix\",\"Mix1\")","v":true},{"$f":"SET.NAME(\"ALastMix\",\"Mix2\")","v":true},{"$f":"SET.NAME(\"Npro\",COUNTA(INDIRECT(\"'\"&S0dat&\"'!\"&Acol&2,FALSE))-1)","v":true},"! Clear the report sheets",{"$f":"WHILE(NOT(ISERROR(FIND(\";\",Atmp1))))","v":true},{"$f":"FORMULA(NOW(),INDIRECT(\"'\"&S0con&\"'!\"&Arow&Rowrep&Acol&5,FALSE))","v":true},{"$f":"FORMULA(\"Finished\",INDIRECT(\"'\"&S0con&\"'!\"&Arow&Rowrep&Acol&4,FALSE))","v":true},{"$f":"dld_clearcols(1,-1)","v":0},{"$f":"  ALERT(\"The report (\"&Atmp1&\") has not been generated.\"&Achr&Achr&\"Please define the data and the Mixture and try again.\",2)","v":true},{"$f":"  ALERT(\"The report (\"&Atmp1&\") has not been generated.\"&Achr&Achr&\"Please define the data and the Mixture and try again.\",2)","v":true},"! Ask for new zoom",null,{"$f":"ACTIVATE(S0mac)","v":true},"VMM_ClearAll","! Reset Introduction",{"$f":"FORMAT.SIZE(239,33)","v":true},null,null,{"$f":"COLUMN.WIDTH(5)","v":true},15,null,15]
{"$rows_left_out":347}
{"sheet":"OutData","index":7,"n_rows":0,"n_cols":0,"rows_kept":0,"cut":false,"hidden":false,"merged":[]}

{"sheet":"BugList","index":8,"n_rows":1,"n_cols":1,"rows_kept":1,"cut":false,"hidden":false,"merged":[]}
["Check for duplicate sample name in In1 and In2"]

{"sheet":"WrkInfo","index":9,"n_rows":18,"n_cols":7,"rows_kept":18,"cut":false,"hidden":false,"merged":[]}
["2",null,"Locus","#","InCol","OutCol","Status"]
["3"]
["4"]
["0"]
["5"]
["6"]
["7"]
["8"]
["9"]
["O"]
["L"]
["X"]
["Y"]
["."]
[","]
{"$rows_left_out":4}
{"sheet":"WrkTmp","index":10,"n_rows":0,"n_cols":0,"rows_kept":0,"cut":false,"hidden":false,"merged":[]}