{"text_format":"1","workbook":"xlsx","n_sheets":10,"sheets":["ControlPanel","Data","RepDetail","RepSummary","RepProfile","Introduction","ReadMe","MS_Macro","DateTime","Work"],"not_rendered":{"charts":0,"images":0,"macros":1,"external_links":0,"defined_names":168,"comments":0,"pivot_tables":0},"unopened":[],"bounds":{"document_bytes":16777216,"sheet_cells":100000,"rows_first":2000,"rows_last":500,"rows_between":2000,"halvings":0,"cell_chars":16384,"cell_head_chars":4096},"cells_cut":0,"cells_raw":0,"read":"whole","date_system":"1900"}

{"sheet":"ControlPanel","index":0,"n_rows":70,"n_cols":10,"rows_kept":70,"cut":false,"hidden":false,"merged":[[10,2,10,5],[11,2,11,5],[0,0,2,0],[5,0,7,0],[79,0,80,0],[10,0,12,0],[70,0,71,0],[73,0,74,0],[20,0,22,0],[76,0,77,0],[28,0,29,0],[31,0,32,0],[15,0,17,0],[35,0,37,0],[25,0,26,0],[12,2,12,5],[15,3,15,6],[16,3,16,6],[25,4,25,6],[20,2,20,5],[21,2,21,5],[23,4,23,6],[24,4,24,6],[17,3,17,6]]}
[null,"***",null,"Status of Report Sheets",null,null,null,null,"Counts"]
[null,null,null,"Status","Last Called","Sheet","Contains",null,"Type","#"]
[null,null,null,"Clear","2017-10-10T10:37:25.830","Data","Comma-delimited STR-profiles for all samples",null,"Total",0]
[null,null,null,"Clear","2017-10-10T10:37:25.830","RepDetail","Details of 'Best Match' of Unmatcheds to other Unmatched samples",null,"Exact Match",0]
[null,null,null,"Clear","2017-10-10T10:37:25.830","RepSummary","Summary of Two 'Best Match'es to other Unmatched samples",null,"Unmatched",0]
[null,null,null,"Clear","2017-10-10T10:37:25.830","RepProfile","Profiles for Unmatched and its 'Best Match' to other Unmatched samples",null,"Unmatch (able?)",0]
[]
[null,null,null,null,null,null,null,null,"Off-ladder alleles"]
[]
[2]
{"$rows_left_out":61}
{"sheet":"Data","index":1,"n_rows":0,"n_cols":0,"rows_kept":0,"cut":false,"hidden":false,"merged":[]}

{"sheet":"RepDetail","index":2,"n_rows":0,"n_cols":0,"rows_kept":0,"cut":false,"hidden":false,"merged":[]}

{"sheet":"RepSummary","index":3,"n_rows":0,"n_cols":0,"rows_kept":0,"cut":false,"hidden":false,"merged":[]}

{"sheet":"RepProfile","index":4,"n_rows":0,"n_cols":0,"rows_kept":0,"cut":false,"hidden":false,"merged":[]}

{"sheet":"Introduction","index":5,"n_rows":77,"n_cols":4,"rows_kept":77,"cut":false,"hidden":false,"merged":[[0,0,34,0],[12,2,12,4],[18,2,18,4],[20,2,20,4],[21,2,21,4],[0,2,0,4],[2,2,2,4],[3,2,3,4],[19,2,19,4],[17,2,17,4],[4,2,7,4],[14,2,14,4],[15,2,15,4],[76,3,79,4],[72,3,74,4],[9,3,9,4],[44,2,44,4],[13,2,13,4],[11,3,11,4],[23,2,23,4],[68,3,70,4],[61,3,66,4],[56,3,59,4],[22,2,22,4],[25,2,25,4],[24,2,24,4],[51,3,51,4],[53,3,54,4],[45,3,49,4],[27,3,28,3],[30,2,30,4],[32,3,34,3],[1,2,1,4],[8,3,8,4],[10,3,10,4]]}
["STR_MatchSamples was developed by David Duewer, Analytical Chemical Division, NIST,\nwith advice and support from the Applied Genetics group, Biochemical Science Division.",null,"Welcome to STR_MatchSamples!"]
[null,null,"Version <22-Apr-2016>"]
[]
[null,null,"STR_MatchSamples enables identification of Exact Batch and Best Match samples in a list of STR profiles."]
[null,null,"The system was designed to compare profiles from electropherograms processed by different software (particularly different \"Expert Systems\") and for the same set of samples analyzed at different times, by different analysts, using different multiplexes, etc.  It has also proven useful for the evaluation of profiles from related individuals, particularly father/son pairs."]
[]
[]
[]
[null,null,"Outputs results include: ","a list of all samples that have the exactly the same alleles at all specified loci;"]
[null,null,null,"for each sample, a list of up-to-10 samples that Best Match;"]
{"$rows_left_out":68}
{"sheet":"ReadMe","index":6,"n_rows":135,"n_cols":15,"rows_kept":135,"cut":false,"hidden":false,"merged":[[43,1,43,15],[134,1,134,15],[72,4,72,15],[92,4,92,15],[108,4,108,15],[128,1,128,15],[129,1,129,15],[131,1,131,15],[126,1,126,15],[133,1,133,15],[121,1,121,15],[123,1,123,15],[124,1,124,15],[125,1,125,15],[11,3,11,15],[16,3,16,15],[25,3,25,15],[53,4,53,10],[21,3,21,15],[22,3,22,15],[23,3,23,15],[32,1,32,14],[36,1,36,14],[34,1,34,15],[27,3,27,15],[40,1,40,15],[38,1,38,15],[48,1,48,15],[45,1,45,15],[46,1,46,15],[26,3,26,15],[2,3,2,15],[3,3,3,15],[6,3,6,15],[7,3,7,15],[5,3,5,15],[13,3,13,15],[14,3,14,15],[15,3,15,15],[8,3,8,15],[17,3,17,15],[18,3,18,15],[19,3,19,15],[24,3,24,15],[9,3,9,15],[10,3,10,15]]}
[null,"  "]
[]
[null,"What is a 'Best Match'?",null,"ControlPanel Summary Information"]
[null,"For a given \"Match From\" profile, the STR_MatchSamples system selects the Best Match \"Match To\" profiles as:",null,"Columns A and B of the ControlPanel worksheet contain the command buttons and the radio-button that specify various user-dettable options."]
[null,"    Those \"Match To\" profiles with the largest percentage of loci that share at least one well-defined allele with the \"Match From\" profile."]
[null,"    Given the same % matching loci, those \"Match To\" profiles with the largest percentage of alleles shared with \"Match From\".",null,"Columns D to G provide information on the progress of the analysis."]
[null,null,null,"  Status: the current condition of the 'Report' worksheets.  The status of the Data worksheet is the most important."]
[null,"In the absence of ambiguous/missing alleles, if A is the Best Match to B then B\" will be the Best Match to A.",null,"    The Data states are: Clear, Loading, Loaded, Checking and Checked.  Data must first be successfully loaded, then checked."]
[null,"However, this symmetry may not hold when one or both of the profiles has ambiguous/missing alleles.",null,"    The RepDetail, RepSummary and RepProfile states are: Clear, Processing and Done!"]
[null,null,null,"  Last Called: The date-time when the last operation occurred that affected the status of the worksheet."]
{"$rows_left_out":126}
{"sheet":"MS_Macro","index":7,"n_rows":400,"n_cols":34,"rows_kept":400,"cut":false,"hidden":false,"merged":[]}
["AutoCall_Globals","Parameter","Value","AutoCall_Exit","AutoCall_StartUp","SMS_Cancel","SMS_ChangeColors","SMS_CheckCutoffs","SMS_CheckData","SMS_Clear","SMS_Control","SMS_DataAdd","SMS_DataUpdate","SMS_GetData","SMS_GetWorksheet","SMS_Print","SMS_Print1","SMS_Print2","SMS_Print3","SMS_ReadMe1","SMS_ReadMe2","SMS_Report","SMS_RepDetail","SMS_RepSummary","SMS_RepProfile","Utility_DateTimeDependencies","Utility_CleanUpNames","Atmp1","Utility_ReVersion","Utility_ShowMacro","Utility_AlignControls","Utility_Colors",1,1]
["! In the normal course of events, this is ONLY run by the Auto_Open VBA Macro","R1C1 mode",true,"! Restore baseline system just prior to quiting","! Set all the constants","! Take care of User interruptions","! Allow user to change the RepProfile color code","! Allow user to change the RepDetail Cutoffs","! Check the structure and all of the profiles","! Clear the decks","! Take user to the Control worksheet","! Get the first dataset","! Get current Counts","! Get the names and alleles for the samples from this worksheet","! Get the data from one worksheet","! Print active sheet","! Print Rep1","! Print Rep1","! Print Rep1","! Take a new user to the ReadMe worksheet","! Take user to the ReadMe worksheet, no nonsence","! Generate the reports","! The detailed report","The summary report","The profile report","! Check the DateTime format setting","! Get rid of all the transcients","Atmp2","! Reset Page Headers of visible files","! Unide all hidden sheets","! Make sure the buttons are in the right spot","! List the colors",2,2]
["! If you diddle any of the constants, make sure you re-run it yourself before you evaluate the diddle","Calculation mode",1,{"$f":"ACTIVATE(S0con)","v":true},{"$f":"ACTIVATE(S0con)","v":true},{"$f":"ACTIVATE(S0con)","v":true},{"$f":"ACTIVATE(S0con)","v":true},{"$f":"ACTIVATE(S0con)","v":true},{"$f":"ACTIVATE(S0con)","v":true},{"$f":"ACTIVATE(S0con)","v":true},{"$f":"ACTIVATE(S0con)","v":true},{"$f":"ACTIVATE(S0con)","v":true},{"$f":"ACTIVATE(S0con)","v":true},{"$f":"ACTIVATE(S0con)","v":true},{"$f":"ACTIVATE(S0con)","v":true},{"$f":"ACTIVATE(S0con)","v":true},{"$f":"ACTIVATE(S0con)","v":true},{"$f":"ACTIVATE(S0con)","v":true},{"$f":"ACTIVATE(S0con)","v":true},{"$f":"DLD_MsgBar(TEXT(NOW(),AlngDatTim)&\" \"&T$1,FALSE)","v":0},{"$f":"DLD_MsgBar(TEXT(NOW(),AlngDatTim)&\" \"&U$1,FALSE)","v":0},{"$f":"ACTIVATE(S0con)","v":true},{"$f":"ACTIVATE(S0con)","v":true},{"$f":"ACTIVATE(S0con)","v":true},{"$f":"ACTIVATE(S0con)","v":true},{"$f":"DLD_MsgBar(TEXT(NOW(),AlngDatTim)&\" \"&Z$1,FALSE)","v":0},null,"Atmp3",{"$f":"DLD_MsgBar(TEXT(NOW(),AlngDatTim)&\" \"&AC$1,FALSE)","v":false},{"$f":"ACTIVATE(S0mac)","v":true},{"$f":"DLD_MsgBar(TEXT(NOW(),AlngDatTim)&\" \"&AE$1,FALSE)","v":0},{"$f":"DLD_MsgBar(TEXT(NOW(),AlngDatTim)&\" \"&AF$1,TRUE)","v":false},3,3]
[{"$f":"SET.NAME(\"Asyst\",\"STR_MatchSamples\")","v":true},"Start datetime","2017-10-10T10:37:23",{"$f":"DLD_MsgBar(TEXT(NOW(),AlngDatTim)&\" \"&D$1,FALSE)","v":0},{"$f":"DLD_MsgBar(TEXT(NOW(),AlngDatTim)&\" \"&E$1,FALSE)","v":0},{"$f":"DLD_setcolwidth(Ched1col,Ched1col+3,TRUE)","v":false},{"$f":"DLD_MsgBar(TEXT(NOW(),AlngDatTim)&\" \"&G$1,FALSE)","v":0},{"$f":"DLD_MsgBar(TEXT(NOW(),AlngDatTim)&\" \"&H$1,FALSE)","v":0},{"$f":"DLD_MsgBar(TEXT(NOW(),AlngDatTim)&\" \"&I$1,FALSE)","v":0},{"$f":"DLD_MsgBar(TEXT(NOW(),AlngDatTim)&\" \"&J$1,FALSE)","v":0},{"$f":"DLD_MsgBar(TEXT(NOW(),AlngDatTim)&\" \"&K$1,FALSE)","v":0},{"$f":"DLD_MsgBar(TEXT(NOW(),AlngDatTim)&\" \"&L$1,FALSE)","v":0},{"$f":"DLD_MsgBar(TEXT(NOW(),AlngDatTim)&\" \"&M$1,FALSE)","v":0},{"$f":"DLD_MsgBar(TEXT(NOW(),AlngDatTim)&\" \"&N$1,FALSE)","v":0},{"$f":"DLD_MsgBar(TEXT(NOW(),AlngDatTim)&\" \"&O$1,FALSE)","v":0},{"$f":"DLD_MsgBar(TEXT(NOW(),AlngDatTim)&\" \"&P$1,FALSE)","v":0},{"$f":"DLD_MsgBar(TEXT(NOW(),AlngDatTim)&\" \"&Q$1,FALSE)","v":0},{"$f":"DLD_MsgBar(TEXT(NOW(),AlngDatTim)&\" \"&R$1,FALSE)","v":false},{"$f":"DLD_MsgBar(TEXT(NOW(),AlngDatTim)&\" \"&S$1,FALSE)","v":false},{"$f":"ACTIVATE(S0int)","v":true},{"$f":"ACTIVATE(S0rme)","v":true},{"$f":"DLD_MsgBar(TEXT(NOW(),AlngDatTim)&\" \"&V$1,FALSE)","v":0},{"$f":"DLD_MsgBar(TEXT(NOW(),AlngDatTim)&\" \"&W$1,FALSE)","v":0},{"$f":"DLD_MsgBar(TEXT(NOW(),AlngDatTim)&\" \"&X$1,FALSE)","v":0},{"$f":"DLD_MsgBar(TEXT(NOW(),AlngDatTim)&\" \"&Y$1,FALSE)","v":0},null,{"$f":"SET.NAME(\"Atmp1\",COUNTA(NAMES()))","v":true},"AutoCall_Exit",null,{"$f":"DLD_MsgBar(TEXT(NOW(),AlngDatTim)&\" \"&AD$1,FALSE)","v":0},null,null,4,4]
[{"$f":"SET.NAME(\"Avers\",\"22-Apr-2016\")","v":true},"Stop datetime","00:00:06",null,null,{"$f":"DLD_gotocell_RC(1,1,1,1,TRUE)","v":false},null,null,null,null,null,null,null,null,null,null,null,null,null,null,{"$f":"DLD_gotocell_RC(1,1,1,1,TRUE)","v":0},null,{"$f":"CANCEL.KEY(TRUE,SMS_Cancel)","v":true},{"$f":"CANCEL.KEY(TRUE,SMS_Cancel)","v":true},{"$f":"CANCEL.KEY(TRUE,SMS_Cancel)","v":true},null,{"$f":"FOR(\"Atmp2\",Atmp1,1,-1)","v":true},"AutoCall_Globals",{"$f":"RUN(AutoCall_Globals,FALSE)","v":{"$error":"#N/A"}},null,{"$f":"RUN(AutoCall_Globals,FALSE)","v":{"$error":"#N/A"}},{"$f":"ACTIVATE(S0mac)","v":true},5,5]
[{"$f":"MESSAGE(FALSE)","v":true},"User","Duewer, David L. Dr.","! Restore calculation and RC states","! Check that the language dependencies are set",{"$f":"ALERT(\"You have interrupted \"&Asyst&\".\"&Achr&\"The message line lists the system's current status.\"&Achr&Achr&\"Go do what you need to do and try again.\",2)","v":true},"! Ensure ReadMe is active","! Get Cutoffs","! Tell user","! Clear the Data worksheet",{"$f":"DLD_gotocell_RC(1,1,6,1,TRUE)","v":0},"! Are data already loaded?",{"$f":"SET.NAME(\"Itmp\",COUNTA(INDIRECT(\"'\"&S0dat&\"'!\"&Acol&2,FALSE))-1)","v":true},"! Loop over the samples","! Find the new  file","! Check if it is ready",{"$f":"SET.NAME(\"Irow\",4)","v":true},{"$f":"SET.NAME(\"Irow\",5)","v":true},{"$f":"SET.NAME(\"Irow\",6)","v":true},"! Make sure Intro is in right format",null,"! Have the data been checked?",null,null,null,"! Make sure that the chart isn't active",{"$f":"  SET.NAME(\"Atmp3\",INDEX(NAMES(),Atmp2))","v":true},"AutoCall_StartUp",null,"! Unhide",null,{"$f":"FOR(\"Itmp\",1,56,1)","v":true},6,6]
[{"$f":"ECHO(FALSE)","v":true},"Number invocations",4,{"$f":"SET.NAME(\"Atmp1\",DEREF(INDIRECT(\"'\"&S0mac&\"'!\"&Arow&2&Acol&3,FALSE)))","v":true},{"$f":"SET.NAME(\"NumNew\",0)","v":true},null,{"$f":"SET.NAME(\"ClrRow\",107)","v":true},{"$f":"SET.NAME(\"LkepMax\",DEREF(INDIRECT(\"'\"&S0con&\"'!\"&Arow&Ckbx1row&Acol&2,FALSE)))","v":true},{"$f":"FORMULA(\"Checking...\",INDIRECT(\"'\"&S0con&\"'!\"&Arow&3&Acol&Ched1col,FALSE))","v":true},{"$f":"ACTIVATE(S0dat)","v":true},null,{"$f":"SET.NAME(\"NsamOld\",COUNTA(INDIRECT(\"'\"&S0dat&\"'!\"&Acol&1,FALSE))-3)","v":true},{"$f":"FORMULA(MAX(0,Itmp),INDIRECT(\"'\"&S0con&\"'!\"&Arow&3&Acol&Ched2col+1,FALSE))","v":true},{"$f":"SET.NAME(\"Asht\",MID(S1dat,FIND(\"]\",S1dat)+1,100))","v":true},{"$f":"SET.NAME(\"Nloc\",COUNTA(INDIRECT(\"'\"&S0dat&\"'!\"&Arow&4,FALSE))-2)","v":true},{"$f":"SET.NAME(\"Atmp\",DEREF(INDIRECT(\"'\"&S0con&\"'!\"&Arow&Irow&Acol&4,FALSE)))","v":true},{"$f":"SET.NAME(\"Igoto\",Cbut5row)","v":true},{"$f":"SET.NAME(\"Igoto\",Cbut6row)","v":true},{"$f":"SET.NAME(\"Igoto\",Cbut7row)","v":true},{"$f":"DLD_gotocell_RC(1,1,27,4,FALSE)","v":0},{"$f":"DLD_MsgBar(TEXT(NOW(),AlngDatTim)&\" \"&U$1&\" > Finished!\",TRUE)","v":0},{"$f":"SET.NAME(\"Atmp\",INDIRECT(\"'\"&S0con&\"'!\"&Arow&3&Acol&Ched1col,FALSE))","v":true},"! Update Control Pannel","! Update Control Pannel","! Update Control Pannel",{"$f":"ACTIVATE(S0dti)","v":true},{"$f":"  IF(ISERROR(MATCH(Atmp3,AB:AB,0)),DELETE.NAME(Atmp3))","v":true},"SMS_Cancel",{"$f":"SET.NAME(\"Atmp\",\"A System for Matching Samples Across Excel Worksheets by Their STR Profiles\")","v":true},{"$f":"ERROR(FALSE)","v":true},"! Reset the User info",{"$f":"  FORMULA(Itmp,INDIRECT(\"'\"&S0mac&\"'!R\"&Itmp&\"C[1]\",FALSE))","v":true},7,7]
[null,null,null,{"$f":"IF(ISERROR(Atmp1),SET.NAME(\"Atmp1\",TRUE))","v":false},{"$f":"RUN(Utility_DateTimeDependencies,FALSE)","v":{"$error":"#N/A"}},{"$f":"HALT()","v":true},{"$f":"ACTIVATE(S0rme)","v":true},{"$f":"IF(NOT(ISLOGICAL(LkepMax)),SET.NAME(\"LkepMax\",TRUE))","v":false},{"$f":"DLD_setcolwidth(Ched1col,Ched1col+1,TRUE)","v":0},{"$f":"SET.NAME(\"Atitle\",\"\")","v":true},{"$f":"DLD_MsgBar(TEXT(NOW(),AlngDatTim)&\" \"&K$1&\" > Finished!\",TRUE)","v":0},{"$f":"IF(NsamOld<1.5)","v":true},{"$f":"SET.NAME(\"Itmp\",COUNTIF(INDIRECT(\"'\"&S0dat&\"'!\"&Acol&1,FALSE),\"=ExactMatch\"))","v":true},{"$f":"SET.NAME(\"Nsam\",COUNTA(INDIRECT(\"'\"&S0dat&\"'!\"&Acol&2,FALSE))-1)","v":true},{"$f":"SET.NAME(\"Afile\",OPEN.DIALOG(,,\"Please select the desired file.\"))","v":true},{"$f":"IF(Atmp<>\"Finished\")","v":true},{"$f":"SET.NAME(\"S0rep\",S0rp1)","v":true},{"$f":"SET.NAME(\"S0rep\",S0rp2)","v":true},{"$f":"SET.NAME(\"S0rep\",S0rp3)","v":true},null,{"$f":"RETURN()","v":true},{"$f":"IF(NOT(Atmp=\"Checked\"))","v":true},{"$f":"FORMULA(\"Processing\",INDIRECT(\"'\"&S0con&\"'!\"&Arow&4&Acol&Ched1col,FALSE))","v":true},{"$f":"FORMULA(\"Processing\",INDIRECT(\"'\"&S0con&\"'!\"&Arow&5&Acol&Ched1col,FALSE))","v":true},{"$f":"FORMULA(\"Processing\",INDIRECT(\"'\"&S0con&\"'!\"&Arow&6&Acol&Ched1col,FALSE))","v":true},{"$f":"ERROR(FALSE)","v":true},{"$f":"NEXT()","v":true},"SMS_ChangeColors",null,{"$f":"  WORKBOOK.UNHIDE(MID(S0dti,FIND(\"]\",S0dti)+1,100))","v":true},{"$f":"ACTIVATE(S0mac)","v":true},{"$f":"  SELECT(INDIRECT(\"'\"&S0mac&\"'!R\"&Itmp&\"C[1]\",FALSE))","v":true},8,8]
["! Make sheetnames",null,null,{"$f":"A1.R1C1(NOT(Atmp1))","v":true},null,null,{"$f":"DLD_gotocell_RC(1,1,ClrRow-1,1,FALSE)","v":0},{"$f":"SET.NAME(\"LkepMin\",DEREF(INDIRECT(\"'\"&S0con&\"'!\"&Arow&Ckbx2row&Acol&2,FALSE)))","v":true},{"$f":"DLD_gotocell_RC(1,1,Cbut3row,1,TRUE)","v":0},{"$f":"dld_Selectcols(1,-1,FALSE)","v":0},{"$f":"RETURN()","v":true},null,{"$f":"FORMULA(Itmp,INDIRECT(\"'\"&S0con&\"'!\"&Arow&4&Acol&Ched2col+1,FALSE))","v":true},{"$f":"ACTIVATE(S0dat)","v":true},{"$f":"IF(ISERROR(Afile),SET.NAME(\"Afile\",FALSE))","v":false},{"$f":"  SET.NAME(\"Atmp1\",MID(S0rep,FIND(\"]\",S0rep)+1,100))","v":true},null,null,null,"! Go to ReadMe",null,{"$f":"  ACTIVATE(S0con)","v":true},{"$f":"FORMULA(NOW(),INDIRECT(\"'\"&S0con&\"'!\"&Arow&4&Acol&Ched1col+1,FALSE))","v":true},{"$f":"FORMULA(NOW(),INDIRECT(\"'\"&S0con&\"'!\"&Arow&5&Acol&Ched1col+1,FALSE))","v":true},{"$f":"FORMULA(NOW(),INDIRECT(\"'\"&S0con&\"'!\"&Arow&6&Acol&Ched1col+1,FALSE))","v":true},{"$f":"  WORKBOOK.UNHIDE(\"DateTime\")","v":true},null,"SMS_CheckCutoffs","! Reset Readme",{"$f":"  WORKBOOK.UNHIDE(MID(S0mac,FIND(\"]\",S0mac)+1,100))","v":{"$error":"#VALUE!"}},{"$f":"ERROR(FALSE)","v":true},{"$f":"  PATTERNS(1,1,Itmp,TRUE)","v":true},9,9]
[{"$f":"SET.NAME(\"Drctry0\",GET.DOCUMENT(2))","v":true},null,null,{"$f":"SET.NAME(\"Atmp2\",DEREF(INDIRECT(\"'\"&S0mac&\"'!\"&Arow&3&Acol&3,FALSE)))","v":true},"! Get the RepProfile color codes",null,null,{"$f":"IF(NOT(ISLOGICAL(LkepMin)),SET.NAME(\"LkepMin\",FALSE))","v":false},null,{"$f":"EDIT.DELETE()","v":true},null,"! Clear everything",{"$f":"SET.NAME(\"Jtmp\",COUNTIF(INDIRECT(\"'\"&S0dat&\"'!\"&Acol&1,FALSE),\"=Unmatched (able?)\"))","v":true},{"$f":"FOR(\"Irow\",RowHed+1,RowLst,1)","v":true},{"$f":"IF(Afile=FALSE)","v":true},{"$f":"  ACTIVATE(S0con)","v":true},{"$f":"RUN(SMS_Print,FALSE)","v":{"$error":"#N/A"}},{"$f":"RUN(SMS_Print,FALSE)","v":{"$error":"#N/A"}},{"$f":"RUN(SMS_Print,FALSE)","v":{"$error":"#N/A"}},{"$f":"ACTIVATE(S0rme)","v":true},null,{"$f":"  DLD_gotocell_RC(1,1,Cbut3row,1,TRUE)","v":false},{"$f":"DLD_setcolwidth(Ched1col,Ched1col+1,TRUE)","v":0},{"$f":"DLD_setcolwidth(Ched1col,Ched1col+1,TRUE)","v":0},{"$f":"DLD_setcolwidth(Ched1col,Ched1col+1,TRUE)","v":0},{"$f":"  SET.NAME(\"Itmp\",FORMULA.GOTO(Arow&1&Acol&1,TRUE))","v":true},{"$f":"RUN(AutoCall_Globals,FALSE)","v":{"$error":"#N/A"}},"SMS_CheckData",{"$f":"ACTIVATE(S0rme)","v":true},{"$f":"  WORKBOOK.UNHIDE(MID(S0wrk,FIND(\"]\",S0wrk)+1,100))","v":{"$error":"#VALUE!"}},{"$f":"  WORKBOOK.UNHIDE(\"MS_Macro\")","v":{"$error":"#VALUE!"}},{"$f":"  SET.NAME(\"Jtmp\",GET.CELL(63,INDIRECT(\"'\"&S0mac&\"'!R\"&Itmp&\"C[1]\",FALSE)))","v":true},10,10]
{"$rows_left_out":391}
{"sheet":"DateTime","index":8,"n_rows":56,"n_cols":6,"rows_kept":56,"cut":false,"hidden":true,"merged":[[0,5,1,5]]}
["Parameter","Value","Format","Status",null,"Date-Time format issue!"]
["Date","2017-10-10T10:37:22.780","d-mmm-yy","Valid"]
["Time",43018.442624768519,"h:mm:ss","Valid",null,"Different versions of Excel support different date and time formats."]
["DateTime","2017-10-10T10:37:22.780","d-mmm-yy h:mm:ss","Valid",null,"The default formats (in Excel-eze, \"dd-mm-yy\" and \"hh:mm:ss\") are not valid for your system."]
[]
[null,null,null,null,null,"Please use Excel's standard Format menubar tool to format the contents of cells B2 and B3 (rows 2 and 3 of col 2)."]
[null,null,null,null,null,"to show the date (day, month and year) and time (hour, minute, second)."]
[null,null,null,null,null,"In the Excel system used to build this program, the date and time format tool is accessible from the"]
[null,null,null,null,null,"\"Number\" page of the \"Cells…\" entry of the \"Format\" menu of the MenuBar (Format > Cells… > Number)."]
[]
{"$rows_left_out":47}
{"sheet":"Work","index":9,"n_rows":18,"n_cols":1,"rows_kept":18,"cut":false,"hidden":true,"merged":[]}
["."]
[","]
[";"]
["?"]
["0"]
["1"]
["2"]
["3"]
["4"]
["5"]
{"$rows_left_out":8}