{"text_format":"1","workbook":"xlsx","n_sheets":10,"sheets":["ControlPanel","Mac_SCF","InData","OutCmp","OutStd","Introduction","ReadMe","Ambiguities","SortOrder","DateTime"],"not_rendered":{"charts":0,"images":0,"macros":1,"external_links":0,"defined_names":3727,"comments":0,"pivot_tables":0},"unopened":[],"bounds":{"document_bytes":16777216,"sheet_cells":100000,"rows_first":2000,"rows_last":500,"rows_between":2000,"halvings":0,"cell_chars":16384,"cell_head_chars":4096},"cells_cut":0,"cells_raw":0,"read":"whole","date_system":"1900"}

{"sheet":"ControlPanel","index":0,"n_rows":52,"n_cols":5,"rows_kept":52,"cut":false,"hidden":false,"merged":[[0,0,2,1],[4,1,5,1],[7,1,8,1],[10,1,11,1],[36,1,37,1],[19,1,20,1],[16,1,17,1],[13,1,14,1],[22,1,23,1],[58,0,59,0],[25,1,26,1],[29,0,30,1],[51,0,51,1],[52,0,53,0],[55,0,56,0],[33,1,34,1]]}
[null,null,null,"Parameter","Value"]
[null,"#Alle",null,"System: ","STR_ConvertFormats <5-Oct-2017> "]
[null,2,null,"Directory: "]
[null,null,null,"Workbook: "]
[null,null,null,"Worksheet: "]
[]
[null,null,null,"Format: "]
[]
[null,2,null,"Operation","Status"]
[null,null,null,"Clear: ","Cleared"]
{"$rows_left_out":43}
{"sheet":"Mac_SCF","index":1,"n_rows":277,"n_cols":43,"rows_kept":277,"cut":false,"hidden":false,"merged":[]}
["SCF_Globals","Parameter","Value","SCF_Exit","SCF_DoItAll","SCF_ClearUser","SCF_FetchUser","SCF_ConvertUser","SCF_SortUser","SCF_SortCheck","SCF_SortSpecify","SCF_CheckUser","SCF_Compact","SCF_StoreStandard","SCF_Store","SCF_FormatHeader","SCF_CODIS","SCF_FSSi","SCF_GMlong","SCF_GMwide","SCF_StructureDataVeryLong","SCF_StructureLong","SCF_DataLong","SCF_StructureWide","SCF_StructureNIST","SCF_DataWide","SCF_Bode","SCF_XML","SCF_Rules","SCF_UniquifySampleNames","SCF_ReadMe","SCF_AmbigClear","SCF_AmbigRecord","SCF_AmbigDisplay","Utility_DateTimeDependencies","Utility_ShowMacro","Utility_ResetHeaders","Utility_AlignControls","Utility_CleanUpNames","Atmp1","Utility_Colors",1,1]
["! In the normal course of events, this is ONLY run by the Auto_Open VBA Macro","R1C1 mode",true,"! Restore baseline system just prior to quiting","! Driver for the entire Convert function","! User access","! User access","! User access","! User access","! Check if current sort-order compatible with the loci that are present","! Get a locus-name sort order","! User access","! Restructure 'Standard' format to 'Compact'","! User access","! Store the converted file","! Make summary output headers","! CODIS conversion","! FSSi conversion","! GeneMapper long-format/Fragment Profiler/Vertical conversion","! GeneMapper wide-format conversion","! Get the structure of \"long\" format files","! Get the structure of \"long\" format files","! Make the data file from \"long\" format files","! Horizontal wide-format conversion","! NIST-compact conversion","! Make the data file from \"wide\" format files","! Bode conversion","! XML (CODIS version) conversion","! If possible, make the rule summary","! Uniquify sample names for one-row/sample structures","! Take a new user to the ReadMe file","! Clear any \"Ambiguity\" infor","! Record an \"Ambiguity\"","! Display the \"Ambiguity\" summary","! Check the DateTime format setting","! Unide all hidden sheets","! Reset Page Headers of visible files","! Make sure the buttons are in the right spot","! Get rid of all the transcients","Atmp2","! List the colors",2,2]
["! If you diddle any of the constants, make sure you re-run it yourself before you evaluate the diddle","Calculation mode",1,{"$f":"MESSAGE(TRUE,TEXT(NOW(),AlngDatTim)&\"  \"&D$1)","v":true},{"$f":"MESSAGE(TRUE,TEXT(NOW(),AlngDatTim)&\"  \"&E$1)","v":true},null,null,null,null,{"$f":"MESSAGE(TRUE,TEXT(NOW(),AlngDatTim)&\" \"&J$1)","v":true},{"$f":"MESSAGE(TRUE,TEXT(NOW(),AlngDatTim)&\" \"&K$1)","v":true},null,{"$f":"MESSAGE(TRUE,TEXT(NOW(),AlngDatTim)&\" \"&M$1)","v":true},null,{"$f":"MESSAGE(TRUE,TEXT(NOW(),AlngDatTim)&Msub0&O$1)","v":true},{"$f":"MESSAGE(TRUE,TEXT(NOW(),AlngDatTim)&Msub0&P$1)","v":true},{"$f":"MESSAGE(TRUE,TEXT(NOW(),AlngDatTim)&Msub0&Q$1)","v":true},{"$f":"MESSAGE(TRUE,TEXT(NOW(),AlngDatTim)&Msub0&R$1)","v":true},{"$f":"MESSAGE(TRUE,TEXT(NOW(),AlngDatTim)&Msub0&S$1)","v":true},{"$f":"MESSAGE(TRUE,TEXT(NOW(),AlngDatTim)&Msub0&T$1)","v":true},{"$f":"MESSAGE(TRUE,TEXT(NOW(),AlngDatTim)&Msub0&U$1)","v":true},{"$f":"MESSAGE(TRUE,TEXT(NOW(),AlngDatTim)&Msub0&V$1)","v":true},{"$f":"MESSAGE(TRUE,TEXT(NOW(),AlngDatTim)&Msub0&W$1)","v":true},{"$f":"MESSAGE(TRUE,TEXT(NOW(),AlngDatTim)&Msub0&X$1)","v":true},{"$f":"MESSAGE(TRUE,TEXT(NOW(),AlngDatTim)&Msub0&Y$1)","v":true},{"$f":"MESSAGE(TRUE,TEXT(NOW(),AlngDatTim)&Msub0&Z$1)","v":true},{"$f":"MESSAGE(TRUE,TEXT(NOW(),AlngDatTim)&Msub0&AA$1)","v":true},{"$f":"MESSAGE(TRUE,TEXT(NOW(),AlngDatTim)&Msub0&AB$1)","v":true},{"$f":"MESSAGE(TRUE,TEXT(NOW(),AlngDatTim)&Msub0&AC$1)","v":false},{"$f":"MESSAGE(TRUE,TEXT(NOW(),AlngDatTim)&Msub0&AD$1)","v":true},{"$f":"MESSAGE(TRUE,TEXT(NOW(),AlngDatTim)&\" \"&AE$1)","v":true},"!=MESSAGE(TRUE,TEXT(NOW(),AlngDatTim)&\" \"&R1C)","!=MESSAGE(TRUE,TEXT(NOW(),AlngDatTim)&\" \"&R1C)",{"$f":"MESSAGE(TRUE,TEXT(NOW(),AlngDatTim)&\" \"&AH$1)","v":true},{"$f":"MESSAGE(TRUE,AI$1)","v":true},{"$f":"MESSAGE(TRUE,TEXT(NOW(),AlngDatTim)&\" \"&AJ$1)","v":true},{"$f":"MESSAGE(TRUE,TEXT(NOW(),AlngDatTim)&\"  \"&AK$1)","v":true},{"$f":"MESSAGE(TRUE,TEXT(NOW(),AlngDatTim)&\"  \"&AL$1)","v":true},null,"Atmp3",{"$f":"MESSAGE(TRUE,TEXT(NOW(),AlngDatTim)&\" \"&AO$1)","v":true},3,3]
[{"$f":"SET.NAME(\"Asyst\",\"STR_ConvertFormats\")","v":true},"Start datetime","2017-10-10T10:36:18",{"$f":"ECHO(FALSE)","v":true},{"$f":"DLD_ActivateSheet(S0con)","v":0},"! Null the message display flag","! Null the message display flag","! Null the message display flag","! Null the message display flag",{"$f":"ECHO(FALSE)","v":true},{"$f":"DLD_ActivateSheet(S0con)","v":0},"! Null the message display flag",{"$f":"ECHO(FALSE)","v":true},"! Setup for standard output",{"$f":"ECHO(FALSE)","v":true},{"$f":"ECHO(FALSE)","v":true},{"$f":"ECHO(FALSE)","v":true},{"$f":"ECHO(FALSE)","v":true},{"$f":"ECHO(FALSE)","v":true},{"$f":"ECHO(FALSE)","v":true},{"$f":"ECHO(FALSE)","v":true},{"$f":"ECHO(FALSE)","v":true},{"$f":"ECHO(FALSE)","v":true},{"$f":"ECHO(FALSE)","v":true},{"$f":"ECHO(FALSE)","v":true},{"$f":"ECHO(FALSE)","v":true},{"$f":"ECHO(FALSE)","v":true},{"$f":"ECHO(TRUE)","v":true},{"$f":"ECHO(FALSE)","v":true},{"$f":"ECHO(FALSE)","v":true},{"$f":"ECHO(FALSE)","v":true},{"$f":"ECHO(FALSE)","v":true},{"$f":"ECHO(FALSE)","v":true},{"$f":"ECHO(FALSE)","v":true},{"$f":"ECHO(FALSE)","v":true},{"$f":"ECHO(FALSE)","v":true},{"$f":"ECHO(FALSE)","v":true},{"$f":"ECHO(FALSE)","v":true},{"$f":"SET.NAME(\"Atmp1\",COUNTA(NAMES()))","v":true},"SCF_AmbigClear",null,4,4]
[{"$f":"SET.NAME(\"Adate\",\"5-Oct-2017\")","v":true},"Stop datetime",43018.442006018522,null,{"$f":"ECHO(TRUE)","v":true},{"$f":"SET.NAME(\"Msub0\",\"  \")","v":true},{"$f":"SET.NAME(\"Msub0\",\"  \")","v":true},{"$f":"SET.NAME(\"Msub0\",\"  \")","v":true},{"$f":"SET.NAME(\"Msub0\",\"  \")","v":true},null,null,{"$f":"SET.NAME(\"Msub0\",\"  \")","v":true},null,{"$f":"SET.NAME(\"Msub0\",\"  \")","v":true},null,null,null,null,null,null,null,null,null,null,null,null,null,null,null,null,null,null,null,null,null,null,{"$f":"RUN($A$1,FALSE)","v":{"$error":"#N/A"}},{"$f":"RUN($A$1,FALSE)","v":{"$error":"#N/A"}},{"$f":"FOR(\"Atmp2\",Atmp1,1,-1)","v":true},"SCF_AmbigDisplay",{"$f":"DLD_ActivateSheet(S0mac)","v":false},5,5]
[{"$f":"MESSAGE(FALSE)","v":true},"User","Duewer, David L. Dr.","! Clear",{"$f":"DLD_Selectcell(1,1)","v":0},null,null,null,null,"! Get the current setting","! Get current order",null,"Check if requisite procedures compete",{"$f":"SET.NAME(\"S0dou\",S0dst)","v":true},"! Raise the conflicting data issue?","! Clear lists","! Get basic parameters","! Get basic parameters","! Get basic parameters","! Get basic parameters","! Get the basic sample and loci info","! Get the sample and loci info","! Clear the datasheets","! Get basic parameters","! Get basic parameters","! Clear the datasheets","! Get the number of alleles","! Clear the assembly area","! Clear the output file","! Count & clean sample names","! Make sure Intro is in right format","! Sero the count","! Update the count","! Unhide the sheet","! Make sure that the chart isn't active","! Unhide",null,null,{"$f":"  SET.NAME(\"Atmp3\",INDEX(NAMES(),Atmp2))","v":true},"SCF_AmbigRecord",{"$f":"FOR(\"Itmp\",1,56,1)","v":true},6,6]
[{"$f":"ECHO(FALSE)","v":true},"Number invocations",10,{"$f":"RUN(SCF_Clear,FALSE)","v":{"$error":"#N/A"}},null,"SCF_Clear","SCF_Fetch","SCF_Convert","SCF_Sort",{"$f":"SET.NAME(\"Isok\",TRUE)","v":true},{"$f":"SET.NAME(\"Atmp\",DEREF(INDIRECT(\"'\"&S0con&\"'!\"&Arow&RowSrt&Acol&Cpara+1,FALSE)))","v":true},"SCF_Check",{"$f":"DLD_ActivateSheet(S0con)","v":0},{"$f":"SET.NAME(\"NanSto\",NanSt1)","v":true},{"$f":"SET.NAME(\"Ntmp\",SUM(INDIRECT(\"'\"&S0con&\"'!\"&Acol&Cloci+4,FALSE)))","v":true},{"$f":"DLD_ActivateSheet(S0con)","v":0},{"$f":"DLD_ActivateSheet(S0din)","v":false},{"$f":"DLD_ActivateSheet(S0din)","v":false},{"$f":"DLD_ActivateSheet(S0din)","v":0},{"$f":"DLD_ActivateSheet(S0din)","v":false},{"$f":"DLD_ActivateSheet(S0din)","v":false},{"$f":"DLD_ActivateSheet(S0din)","v":0},{"$f":"DLD_ActivateSheet(S0din)","v":0},{"$f":"DLD_ActivateSheet(S0din)","v":false},{"$f":"DLD_ActivateSheet(S0din)","v":0},{"$f":"DLD_ActivateSheet(S0din)","v":0},{"$f":"DLD_ActivateSheet(S0din)","v":false},{"$f":"DLD_ActivateSheet(S0din)","v":false},{"$f":"DLD_ActivateSheet(S0dst)","v":false},{"$f":"DLD_ActivateSheet(S0din)","v":0},{"$f":"DLD_ActivateSheet(S0int)","v":false},{"$f":"SET.NAME(\"Nodd\",0)","v":true},{"$f":"SET.NAME(\"Nodd\",Nodd+1)","v":true},{"$f":"ERROR(FALSE)","v":true},{"$f":"DLD_ActivateSheet(S0dti)","v":0},{"$f":"ERROR(FALSE)","v":true},{"$f":"SET.NAME(\"Atmp\",\"An STR Profile Format Conversion Tool\")","v":true},"! Clear the sheets",{"$f":"  IF(ISERROR(MATCH(Atmp3,AN:AN,0)),DELETE.NAME(Atmp3))","v":false},"SCF_Bode",{"$f":"  FORMULA(Itmp,INDIRECT(\"'\"&S0mac&\"'!R\"&Itmp&\"C[1]\",FALSE))","v":true},7,7]
[null,null,null,null,"! Set the message display flag for the subroutine calls","! Clear the decks","! Get the input data","! Get the input data","! Sort the loci",{"$f":"DLD_ActivateSheet(S0con)","v":0},{"$f":"IF(LEN(Atmp)<1.5,SET.NAME(\"Atmp\",DEREF(INDIRECT(\"'\"&S0con&\"'!\"&Arow&RowTyp&Acol&Cpara+1,FALSE))))","v":true},"! Count up the number of \"odd\" alleles",{"$f":"SELECT(INDIRECT(\"'\"&S0con&\"'!\"&Arow&RowCom&Acol&Cpara+1,FALSE))","v":true},{"$f":"SET.NAME(\"RowTmp\",RowSt1)","v":true},{"$f":"IF(Ntmp>0.5)","v":true},{"$f":"SET.NAME(\"Nchg\",0)","v":true},{"$f":"SET.NAME(\"RowFst\",GET.DOCUMENT(9))","v":true},{"$f":"SET.NAME(\"RowFst\",GET.DOCUMENT(9))","v":true},{"$f":"SET.NAME(\"RowFst\",GET.DOCUMENT(9))","v":true},{"$f":"SET.NAME(\"RowFst\",GET.DOCUMENT(9))","v":true},{"$f":"SELECT(Acol&1&Asep&Acol&256)","v":true},{"$f":"SET.NAME(\"Nloc\",0)","v":true},{"$f":"SELECT(Acol&1&Asep&Acol&256)","v":true},{"$f":"SET.NAME(\"RowFst\",GET.DOCUMENT(9))","v":true},{"$f":"SET.NAME(\"RowFst\",GET.DOCUMENT(9))","v":true},{"$f":"SELECT(Acol&2&Asep&Acol&256)","v":true},{"$f":"SET.NAME(\"RowHed\",1)","v":true},{"$f":"SELECT(INDIRECT(\"'\"&S0din&\"'!\"&Acol&2&Asep&Acol&10,FALSE))","v":true},{"$f":"SELECT(Acol&Coffs+1+Nloc&Asep&Acol&256)","v":false},{"$f":"SET.NAME(\"Nsam\",0)","v":true},{"$f":"DLD_Selectcell(26,4)","v":false},null,null,{"$f":"  WORKBOOK.UNHIDE(MID(S0err,FIND(\"]\",S0err)+1,100))","v":true},{"$f":"ERROR(FALSE)","v":true},{"$f":"  WORKBOOK.UNHIDE(MID(S0dti,FIND(\"]\",S0dti)+1,100))","v":true},null,{"$f":"RUN(SCF_Clear,FALSE)","v":{"$error":"#N/A"}},{"$f":"NEXT()","v":true},"SCF_Check",{"$f":"  SELECT(INDIRECT(\"'\"&S0mac&\"'!R\"&Itmp&\"C[1]\",FALSE))","v":true},8,8]
["! Make sheetnames",null,null,"! Restore calculation and RC states",{"$f":"SET.NAME(\"Msub0\",\" \"&E$1&\" > \")","v":true},{"$f":"MESSAGE(TRUE,TEXT(NOW(),AlngDatTim)&Msub0&F$7)","v":true},{"$f":"MESSAGE(TRUE,TEXT(NOW(),AlngDatTim)&Msub0&G$7)","v":true},{"$f":"MESSAGE(TRUE,TEXT(NOW(),AlngDatTim)&Msub0&H$7)","v":true},{"$f":"MESSAGE(TRUE,TEXT(NOW(),AlngDatTim)&Msub0&I$7)","v":true},{"$f":"SET.NAME(\"Atmp\",DEREF(INDIRECT(\"'\"&S0con&\"'!\"&Arow&RowTyp&Acol&Cpara+1,FALSE)))","v":true},{"$f":"IF(LEN(Atmp)<1.5,SET.NAME(\"Atmp\",\": Alphabetical\"))","v":true},{"$f":"MESSAGE(TRUE,TEXT(NOW(),AlngDatTim)&Msub0&L$7)","v":true},{"$f":"CLEAR(3)","v":true},{"$f":"SET.NAME(\"Fadd\",\"NISTs\")","v":true},{"$f":"  DLD_ActivateSheet(S0con)","v":false},null,{"$f":"SET.NAME(\"RowLst\",GET.DOCUMENT(10))","v":true},{"$f":"SET.NAME(\"RowLst\",GET.DOCUMENT(10))","v":true},{"$f":"SET.NAME(\"RowLst\",GET.DOCUMENT(10))","v":true},{"$f":"SET.NAME(\"RowLst\",GET.DOCUMENT(10))","v":true},{"$f":"PATTERNS(0)","v":true},{"$f":"SET.NAME(\"Nsam\",0)","v":true},{"$f":"PATTERNS(0)","v":true},{"$f":"SET.NAME(\"RowLst\",GET.DOCUMENT(10))","v":true},{"$f":"SET.NAME(\"RowLst\",GET.DOCUMENT(10))","v":true},{"$f":"PATTERNS(0)","v":true},{"$f":"SET.NAME(\"RowLst\",MATCH(\"Generate CMF\",INDIRECT(\"'\"&S0din&\"'!\"&Acol&1,FALSE),0)-1)","v":true},{"$f":"CLEAR(3)","v":true},{"$f":"CLEAR(3)","v":true},{"$f":"FOR(\"Irow\",RowHed+1,RowLst,1)","v":true},null,"! Clear the sheet","! Record in locus and sample lists on the ControlPanel",{"$f":"ERROR(TRUE)","v":true},{"$f":"  WORKBOOK.UNHIDE(MID(S0dti,FIND(\"]\",S0dti)+1,100))","v":true},{"$f":"  WORKBOOK.UNHIDE(MID(S0err,FIND(\"]\",S0err)+1,100))","v":true},"! Reset Readme",null,null,"SCF_CheckUser",{"$f":"  PATTERNS(1,1,Itmp,TRUE)","v":true},9,9]
[{"$f":"SET.NAME(\"DirA\",GET.DOCUMENT(2))","v":true},null,null,{"$f":"SET.NAME(\"Atmp1\",DEREF(INDIRECT(\"'\"&S0mac&\"'!\"&Arow&2&Acol&3,FALSE)))","v":true},null,{"$f":"ECHO(FALSE)","v":true},{"$f":"ECHO(FALSE)","v":true},{"$f":"ECHO(FALSE)","v":true},{"$f":"ECHO(FALSE)","v":true},null,{"$f":"IF(ISERROR(FIND(\":\",Atmp)),SET.NAME(\"Atmp\",\": \"&Atmp))","v":false},{"$f":"ECHO(FALSE)","v":true},{"$f":"SELECT(INDIRECT(\"'\"&S0con&\"'!\"&Arow&RowSt2&Acol&Cpara+1,FALSE))","v":true},null,{"$f":"  DLD_Selectcell(RowBcom,2)","v":false},{"$f":"STR_FormatHeader(Cloci,Csamp)","v":0},{"$f":"SET.NAME(\"ColFst\",GET.DOCUMENT(11))","v":true},{"$f":"SET.NAME(\"ColFst\",GET.DOCUMENT(11))","v":true},{"$f":"SET.NAME(\"ColFst\",GET.DOCUMENT(11))","v":true},{"$f":"SET.NAME(\"ColFst\",GET.DOCUMENT(11))","v":true},null,{"$f":"FOR(\"Irow\",RowHed+1,RowLst,1)","v":true},{"$f":"DLD_ActivateSheet(S0dst)","v":0},{"$f":"SET.NAME(\"ColFst\",GET.DOCUMENT(11))","v":true},{"$f":"SET.NAME(\"ColFst\",GET.DOCUMENT(11))","v":true},{"$f":"DLD_ActivateSheet(S0dst)","v":0},{"$f":"IF(ISERROR(RowLst),SET.NAME(\"RowLst\",1))","v":false},null,null,{"$f":"  SET.NAME(\"Nval\",COUNTA(INDIRECT(\"'\"&S0din&\"'!\"&Arow&Irow,FALSE)))","v":true},"! Go to ReadMe",{"$f":"ERROR(FALSE)","v":true},{"$f":"SET.NAME(\"Atmp\",DEREF(INDIRECT(\"'\"&S0con&\"'!\"&Arow&2+Iloc&Acol&Cloci+4,FALSE)))","v":true},{"$f":"DLD_ActivateSheet(S0err)","v":false},{"$f":"  SET.NAME(\"Itmp\",DLD_Selectcell(1,1))","v":true},{"$f":"  WORKBOOK.UNHIDE(MID(S0mac,FIND(\"]\",S0mac)+1,100))","v":{"$error":"#VALUE!"}},{"$f":"DLD_ActivateSheet(S0rme)","v":false},"! Format the Introduction",{"$f":"RUN($A$1,FALSE)","v":{"$error":"#N/A"}},"SCF_Clear",{"$f":"  SET.NAME(\"Jtmp\",GET.CELL(63,INDIRECT(\"'\"&S0mac&\"'!R\"&Itmp&\"C[1]\",FALSE)))","v":true},10,10]
{"$rows_left_out":268}
{"sheet":"InData","index":2,"n_rows":0,"n_cols":0,"rows_kept":0,"cut":false,"hidden":false,"merged":[]}

{"sheet":"OutCmp","index":3,"n_rows":0,"n_cols":0,"rows_kept":0,"cut":false,"hidden":false,"merged":[]}

{"sheet":"OutStd","index":4,"n_rows":0,"n_cols":0,"rows_kept":0,"cut":false,"hidden":false,"merged":[]}

{"sheet":"Introduction","index":5,"n_rows":89,"n_cols":4,"rows_kept":89,"cut":false,"hidden":false,"merged":[[78,3,78,4],[83,3,84,4],[80,3,81,4],[72,3,73,4],[1,0,33,0],[20,2,20,4],[1,2,1,4],[2,2,2,4],[13,2,13,4],[19,2,19,4],[21,2,21,4],[66,3,68,4],[60,3,65,4],[56,3,58,4],[3,2,3,4],[5,2,5,4],[16,2,16,4],[11,2,11,4],[12,2,12,4],[24,2,24,4],[23,2,23,4],[75,3,76,4],[0,2,0,4],[6,2,9,4],[52,3,54,4],[14,2,14,4],[15,2,15,4],[25,3,26,3],[22,2,22,4],[17,2,17,4],[44,3,48,4],[29,2,29,4],[43,2,43,4],[69,3,70,4],[30,3,32,3],[50,3,50,4],[28,2,28,4]]}
[null,null,"Welcome to STR_ConvertFormats!"]
["STR_ConvertFormats was developed by David Duewer, Analytical Chemical Division, NIST,\nwith advice and support from the Applied Genetics group, Biochemical Science Division."]
[null,null,"STR_ConvertFormats converts STR profiles stored in a variety of Excel worksheet formats to a single \"standard\" form."]
[null,null,"Development of STR_ConvertFormats was funded in part by the National Institute of Justice."]
[]
[null,null,"From what formats…"]
[null,null,"STR_ConvertFormats currently accepts one-locus per row output from FSSi and GeneMapper, multiple-loci per row output from Genemapper, one-locus per row output from two \"homebuilt\" and one-row per sample output from three \"homebuilt\" systems.  Other formats can be added at need."]
[]
[]
[]
{"$rows_left_out":80}
{"sheet":"ReadMe","index":6,"n_rows":112,"n_cols":16,"rows_kept":112,"cut":false,"hidden":false,"merged":[[61,6,61,7],[59,8,59,9],[60,8,60,9],[61,8,61,9],[61,4,61,5],[60,6,60,7],[51,1,51,8],[52,1,52,8],[59,4,59,5],[60,4,60,5],[59,6,59,7],[58,4,58,5],[58,8,58,9],[55,3,55,15],[53,1,53,8],[58,6,58,7],[43,1,43,8],[42,1,42,9],[45,1,45,8],[40,3,40,15],[50,1,50,8],[49,1,49,8],[47,1,47,5],[44,1,44,8],[46,1,46,8],[48,1,48,5],[33,3,33,15],[34,3,34,15],[35,3,35,15],[15,3,15,15],[12,3,12,15],[14,3,14,15],[22,3,22,15],[23,3,23,15],[25,3,25,15],[26,3,26,15],[27,3,27,15],[28,3,28,15],[29,3,29,15],[5,3,5,15],[1,3,1,15],[2,3,2,15],[3,3,3,15],[4,3,4,15],[6,3,6,15],[7,3,7,15],[8,3,8,15],[9,3,9,15],[10,3,10,15],[39,3,39,15],[38,3,38,15],[37,3,37,15],[11,3,11,15],[13,3,13,15],[17,3,17,15],[18,3,18,15],[19,3,19,15],[24,3,24,15],[30,3,30,15],[36,3,36,15],[16,3,16,15],[31,3,31,15],[20,3,20,15],[21,3,21,15],[32,3,32,15]]}
[]
[null,"ControlPanel Commands",null,"ControlPanel Summary Information"]
[null,"All of the STR_ConvertFormats commands are accessed from the ControlPanel worksheet.",null,"Columns D and E of the ControlPanel worksheet list several key attributes of the 'Fetch'ed worksheet…"]
[null,null,null,"  Directory: The complete directory path for the selected workbook"]
[null,"There are currently twelve commands, each accessed from it's own Command Button:",null,"  Workbook: The name of the selected workbook"]
[null,"  Do It All: Attempts to execute the following eight commands in sequential order",null,"  Worksheet: The name of the selected worksheet"]
[null,"    Clear: Clears all status reports and working data.",null,"  Format: The format of the DNA profile data on the selected worksheet"]
[null,"    Fetch: Allows user to specify a particular worksheet, identifies its format and copies it to the working InData worksheet."]
[null,"    Convert: Converts data on the InData worksheet into the NISTstandard format on the OutStd worksheet.",null,"Columns D and E also list the status of the component operations…."]
[null,"    LocSort: Standardizes the locus names and sorts them into a specified order on the OutStd worksheet.",null,"  Clear: Will either be empty or 'Cleared'"]
{"$rows_left_out":103}
{"sheet":"Ambiguities","index":7,"n_rows":1,"n_cols":9,"rows_kept":1,"cut":false,"hidden":true,"merged":[]}
["Row","Col",null,"SampleCode","Locus","Allele","Value",null,"Diagnosis"]

{"sheet":"SortOrder","index":8,"n_rows":78,"n_cols":30,"rows_kept":78,"cut":false,"hidden":false,"merged":[]}
["Locus","aka","aka","aka","aka","aka","aka","aka","aka",null,"Alphabetical","Cofiler","Fusion","GlobalFiler","Identifiler","MiniFiler","NGM","NGM SElect","PP16","PP18D","PP21","PP-ESI-17","PP-ESX-17","PPF6","PPY","PPY23","Profler Plus","SGM Plus","YfilerPlus","New"]
["AMEL","Amelogenin","Amelo",null,null,null,null,null,null,null,"AMEL","D3S1358","AMEL","D3S1358","D8S1179","D13S317","D10S1248","D10S1248","D3S1358","D3S1358","AMEL","AMEL","AMEL","AMEL","DYS390","DYS576","D3S1358","D3S1358","DYS576"]
["CSF1PO","CSF",null,null,null,null,null,null,null,null,"CSF1PO","D16S539","D3S1358","vWA","D21S11","D7S820","vWA","vWA","TH01","TH01","D3S1358","D3S1358","D3S1358","D3S1358","DYS389I","DYS389I","vWA","vWA","DYS389I"]
["D10S1248","D10",null,null,null,null,null,null,null,null,"D10S1248","AMEL","D1S1656","D16S539","D7S820","AMEL","D16S539","D16S539","D21S11","D21S11","D1S1656","D19S433","TH01","D1S1656","DYS439","DYS448","FGA","D16S539","DYS635"]
["D10S1435",null,null,null,null,null,null,null,null,null,"D10S1435","TH01","D2S441","CSF1PO","CSF1PO","D2S1338","D2S1338","D2S1338","D18S51","D18S51","D6S1043","D2S1338","D21S11","D2S441","DYS389II","DYS389II","AMEL","D2S1338","DYS389II"]
["D11S4463",null,null,null,null,null,null,null,null,null,"D11S4463","TPOX","D10S1248","TPOX","D3S1358","D21S11","AMEL","AMEL","Penta_E","Penta_E","D13S317","D22S1045","D18S51","D10S1248","DYS438","DYS19","D8S1179","AMEL","DYS627"]
["D12ATA63",null,null,null,null,null,null,null,null,null,"D12ATA63","CSF1PO","D13S317","Yindel","TH01","D16S539","D8S1179","D8S1179","D5S818","D5S818","Penta_E","D16S539","D10S1248","D13S317","DYS437","DYS391","D21S11","D8S1179","DYS460"]
["D12S391","D12",null,null,null,null,null,null,null,null,"D12S391","D7S820","Penta E","AMEL","D13S317","D18S51","D21S11","D21S11","D13S317","D13S317","D16S539","D18S51","D1S1656","Penta_E","DYS19","DYS481","D18S51","D21S11","DYS458"]
["D13S317","D13",null,null,null,null,null,null,null,null,"D13S317",null,"D16S539","D8S1179","D16S539","CSF1PO","D18S51","D18S51","D7S820","D7S820","D18S51","D1S1656","D2S1338","D16S539","DYS392","DYS549","D5S818","D18S51","DYS19"]
["D14S1434",null,null,null,null,null,null,null,null,null,"D14S1434",null,"D18S51","D21S11","D2S1338","FGA","D22S1045","D22S1045","D16S539","D16S539","D2S1338","D10S1248","D16S539","D18S51","DYS393","DYS533","D13S317","D19S433","YGATAH4"]
{"$rows_left_out":69}
{"sheet":"DateTime","index":9,"n_rows":56,"n_cols":6,"rows_kept":56,"cut":false,"hidden":true,"merged":[[0,5,1,5]]}
["Parameter","Value","Format","Status",null,"Whoops… Date-Time format issue!"]
["Date","2017-10-10T10:36:18.460","dd-mmm-yy","Valid"]
["Time",43018.441880324077,"h:mm:ss","Valid",null,"Different versions of Excel support different date and time formats."]
["DateTime","2017-10-10T10:36:18.460","dd-mmm-yy h:mm:ss","Valid",null,"The default formats (in Excel-eze, \"dd-mm-yy\" and \"hh:mm:ss\") are not valid for your system."]
[]
[null,null,null,null,null,"Please use Excel's standard Format menubar tool to format the contents of cells B2 and B3 (rows 2 and 3 of col 2)."]
[null,null,null,null,null,"to show the date (day, month and year) and time (hour, minute, second)."]
[null,null,null,null,null,"In the Excel system used to build this program, the date and time format tool is accessible from the"]
[null,null,null,null,null,"\"Number\" page of the \"Cells…\" entry of the \"Format\" menu of the MenuBar (Format > Cells… > Number)."]
[]
{"$rows_left_out":46}